program: Gaussian 09
title: 000268891
version: EM64L-G09RevD.01
frameworkgroup: C1[X(C15H12S6)]
method: RPBEPBE
basis: SDD
operation: Freq
keyword: #pfreq=noraman
keyword: PBEPBE/SDD
title: #p freq=noraman PBEPBE/SDD
converged: YES YES NO NO
title: Mulliken charges:
elementType: S S S S S S C C C C C C C C C C C C C C C H H H H H H H H H H H H
charge: 0.298491 0.298544 0.299029 0.246719 0.246583 0.246663 -0.776195 -0.776059 -0.776171 -0.012137 -0.011865 -0.012187 -0.229654 -0.229940 -0.229731 -0.127880 -0.127752 -0.127784 -0.508405 -0.508414 -0.508414 0.319761 0.319457 0.319720 0.276130 0.276047 0.276109 0.246644 0.246647 0.246621 0.266468 0.266474 0.266479
chargesum: 0.00000
title: Mulliken charges with hydrogens summed into heavy atoms:
elementType: S S S S S S C C C C C C C C C C C C C C C
charge: 0.298491 0.298544 0.299029 0.246719 0.246583 0.246663 -0.456435 -0.456603 -0.456451 -0.012137 -0.011865 -0.012187 0.046476 0.046108 0.046379 0.118763 0.118896 0.118838 -0.241937 -0.241939 -0.241934
polarizability: 3.11676390e+02 -1.82315814e-02 3.11372058e+02 -1.31342658e-01 2.72266090e-02 2.18009820e+02
1716.lowfreq: -2.9643 -0.0028 -0.0008 0.0006 4.4091 5.4592 19.1343 20.6509 23.0798
frequency: 19.1085 20.6085 23.0656 33.8929 47.2366 47.8398 63.7534 65.3557 104.7243 171.2615 171.8273 171.9326 176.2887 177.8728 224.1023 245.3341 246.2074 303.3045 336.8966 337.3785 363.5461 476.2626 476.7335 483.2421 559.5462 559.7737 566.8743 567.8600 567.9136 580.7045 620.1972 637.9278 638.9036 648.9808 676.3288 677.0806 692.9947 693.2675 695.9925 700.5611 704.7771 705.1540 725.3882 726.0073 775.5093 821.1989 821.4055 825.3556 839.6854 840.7430 841.0268 913.6262 913.7869 913.8071 1026.7082 1027.0210 1027.2254 1077.3007 1077.4988 1078.2118 1114.1371 1114.3939 1119.1905 1125.3375 1177.2044 1180.1502 1227.0412 1227.4110 1232.6285 1256.4462 1257.8917 1278.2132 1343.3700 1343.5460 1344.8799 1466.9280 1467.8745 1467.9500 1545.7837 1546.3776 1546.4683 3026.6736 3035.3022 3037.0948 3172.9788 3173.2924 3173.4289 3189.9452 3190.3298 3190.3987 3238.3698 3238.7028 3239.3156
redmass: 8.5907 8.0879 7.1257 7.9571 5.5961 5.5698 10.3398 10.5429 6.7929 7.5124 8.2901 8.9630 10.1657 8.5506 9.6792 6.4560 6.4615 7.1310 15.1214 15.1543 17.0290 5.7935 5.7886 6.0140 9.2067 9.1212 3.6090 3.3704 3.3815 10.2425 6.8797 7.3800 7.3409 8.1978 5.3679 5.3933 3.5888 3.4008 6.7381 1.1705 1.5797 1.6086 5.6313 5.6902 6.1995 4.6869 4.6827 4.7172 1.3025 1.3177 1.3165 1.3795 1.3793 1.3789 1.8465 1.8452 1.8498 1.2913 1.2910 1.2785 1.3585 1.3635 1.4724 1.0450 1.1112 1.1245 1.6840 1.6606 1.5096 1.5328 1.5258 1.7668 2.2151 2.2101 2.1683 7.1670 7.1322 7.1405 5.7296 5.7850 5.7912 1.0860 1.0869 1.0868 1.0902 1.0903 1.0903 1.0978 1.0977 1.0977 1.1004 1.1004 1.1003
irintensity: 0.0865 0.0683 0.0371 0.2637 0.5483 0.5744 1.1768 1.1310 0.0001 0.0066 0.0122 0.0922 1.1021 1.0058 0.0306 0.0035 0.0045 0.0000 0.8291 0.8548 0.6787 0.7551 0.7560 0.0003 0.5538 0.4866 0.0117 2.0468 2.0854 0.5133 0.0039 28.4620 29.1127 7.0703 12.0831 11.0254 10.5753 12.1092 8.8241 0.1378 153.0120 152.3798 95.2076 95.3781 26.8156 1.5245 1.4687 13.5371 0.3238 6.6851 7.1216 0.1869 0.1679 0.3286 3.7684 3.2503 21.3958 8.6198 8.8244 4.6538 9.6846 9.9983 5.0070 0.1926 22.2533 21.9289 36.3096 36.0970 0.1524 4.8025 4.9254 5.1607 1.5878 1.6451 0.2447 26.4506 2.9109 2.9383 2.4605 1.6706 1.6564 17.0620 0.5330 0.5207 11.0194 11.7277 5.8167 1.2367 1.3006 1.5227 0.4234 0.4343 0.4333
temp: 298.150 k
press: 1.00000 atm
elementType: 16 16 16 16 16 16 6 6 6 6 6 6 6 6 6 6 6 6 6 6 6 1 1 1 1 1 1 1 1 1 1 1 1
symmnumber: 1
zpe: 585232.1 jmol-1
zpe.correction: 0.222903 hartree
zpe.thermalcorrener: 0.243947 hartree
zpe.thermalcorrenthalpy: 0.244892 hartree
zpe.thermalcorrgfe: 0.167930 hartree
zpe.sumelectzpe: -2965.606952 hartree
zpe.sumelectthermal: -2965.585908 hartree
zpe.sumelectthermalent: -2965.584963 hartree
zpe.sumelectthermalfe: -2965.661925 hartree
dipole: 0.0051 0.0017 -0.2605
dipole: 0.2606
quadrupole: -153.6012 -153.7107 -157.3858
quadrupole: 0.0112 -0.0451 0.0111
quadrupole: 1.2980 1.1885 -2.4866 0.0112 -0.0451 0.0111
hfenergy: -2965.829855 hartree
pointgroup: C01 [X(C15H12S6)]
dipole: 0.0012702 0.0016498 -0.1024914 debye
polarizability: 311.6002068|0.1330275|311.4481645|-0.147317|-0.058966|218.0098967 unknown
InChI: InChI=1S/C15H12S6/c1-4-10(16-7-1)13-19-14(11-5-2-8-17-11)21-15(20-13)12-6-3-9-18-12/h1-9,13-15H
charge 0 multiplicity 1
33 atoms
S  0.233108 -1.834355 -0.310817
S  1.469502 1.118653 -0.307821
S  -1.706254 0.713094 -0.313875
S  3.990248 -1.670101 1.505453
S  -3.441899 -2.620241 1.506787
S  -0.552947 4.289233 1.505924
C  1.541507 -0.647374 0.409144
C  -1.332878 -1.013337 0.406221
C  -0.214546 1.657872 0.407964
C  2.896385 -1.211144 0.138461
C  -2.499825 -1.903928 0.137489
C  -0.399755 3.113859 0.138147
C  3.507727 -1.459026 -1.08577
C  -3.023303 -2.309319 -1.085461
C  -0.481458 3.769314 -1.085651
C  4.834356 -2.010482 -0.971708
C  -4.164776 -3.181332 -0.968577
C  -0.664634 5.194169 -0.97068
C  5.247799 -2.188102 0.339603
C  -4.522651 -3.449732 0.34362
C  -0.723678 5.639375 0.340945
H  1.336263 -0.563479 1.490535
H  -1.156523 -0.876893 1.487433
H  -0.18848 1.436283 1.489099
H  3.012905 -1.249221 -2.037178
H  -2.596368 -1.986492 -2.038126
H  -0.411628 3.237175 -2.037493
H  5.459121 -2.266164 -1.830611
H  -4.700864 -3.594297 -1.826162
H  -0.749191 5.864385 -1.829194
H  6.190029 -2.581198 0.717238
H  -5.334056 -4.068113 0.723183
H  -0.854035 6.651716 0.719176
