program: Gaussian 09
title: 000268874
version: EM64L-G09RevD.01
frameworkgroup: C1[X(C8H18N3P)]
method: RPBEPBE
basis: SDD
operation: Freq
keyword: #p
keyword: freq=noraman
keyword: PBEPBE/SDD
title: #p freq=noraman PBEPBE/SDD
converged: NO YES NO NO
title: Mulliken charges:
elementType: P N N N C C C C C C C C H H H H H H H H H H H H H H H H H H
charge: 0.952460 -0.434711 -0.468644 -0.499069 -0.408750 -0.344434 -0.413659 -0.436438 -0.329804 -0.317419 -0.597744 -0.593990 0.232387 0.207980 0.214208 0.238793 0.214534 0.216733 0.217734 0.215375 0.218776 0.195447 0.213085 0.204805 0.219346 0.200241 0.223676 0.234137 0.205709 0.219235
chargesum: 0.00000
title: Mulliken charges with hydrogens summed into heavy atoms:
elementType: P N N N C C C C C C C C
charge: 0.952460 -0.434711 -0.468644 -0.499069 0.031616 0.108568 0.017608 -0.003329 0.084419 0.100470 0.045520 0.065092
polarizability: 1.50488465e+02 -2.40978930e+00 1.26811340e+02 -4.03081606e+00 1.93766912e-01 1.08641317e+02
1716.lowfreq: -8.3101 -0.0015 0.0008 0.0014 9.7556 17.4856 35.3707 49.4117 62.5898
frequency: 34.9113 48.1452 62.3771 83.1843 104.8706 128.9463 182.6488 200.0615 209.4011 225.0297 241.2195 276.7481 307.7447 360.0999 368.0122 449.3947 479.5939 553.9803 581.5750 612.0552 625.1177 678.2580 807.2120 844.7120 848.4674 877.2004 908.8440 925.9966 935.6739 967.8230 1002.0774 1035.1223 1045.4229 1071.3893 1086.0342 1107.3777 1122.2114 1127.8365 1137.3207 1154.0525 1176.9009 1186.3081 1192.1316 1216.7155 1220.8350 1237.6719 1240.2340 1246.0312 1284.5178 1288.7120 1301.9203 1317.7211 1325.2167 1347.1600 1429.0717 1430.3015 1457.6192 1463.6806 1466.0640 1471.3437 1472.9533 1474.9660 1482.1350 1487.6711 1489.3135 1497.9128 2881.6295 2888.8355 2895.6718 2899.7543 2952.0569 2957.1545 2991.0006 2996.5685 2998.8247 3001.3073 3004.4549 3012.1156 3047.2076 3053.6265 3055.8321 3072.8169 3073.0207 3083.7152
redmass: 2.5778 2.0046 3.2418 2.9526 3.1230 2.4086 1.1902 2.1091 1.8290 1.7771 2.5824 1.9670 2.4898 3.5974 3.0824 5.7732 7.7493 4.8014 3.0513 5.0289 2.8080 2.0601 1.6423 1.5828 1.5830 3.0143 2.4296 2.3107 2.0973 2.2638 1.9083 2.3883 2.2653 1.4709 1.6783 1.2648 1.4085 5.8523 1.6161 1.8553 1.2861 1.2700 1.8485 2.5505 1.2203 2.8500 1.8633 1.4400 1.2931 1.2895 1.2801 1.3147 1.3908 1.4753 1.1418 1.1463 1.0581 1.0755 1.0471 1.0786 1.0806 1.0817 1.0921 1.0721 1.0588 1.0623 1.0546 1.0665 1.0587 1.0581 1.0674 1.0704 1.0799 1.0591 1.0888 1.0844 1.0951 1.0632 1.0966 1.0983 1.1007 1.0971 1.0975 1.1027
irintensity: 0.7671 0.1691 0.9012 0.6925 6.3202 2.3456 0.0686 0.5920 4.4766 7.3012 1.1828 3.5403 1.4076 0.9250 11.8023 8.7558 55.2566 32.1142 2.5699 26.6139 14.5187 31.4882 5.7519 23.1955 1.4016 17.6764 97.6935 4.9484 47.8810 77.1780 15.6775 39.1778 12.0642 0.0785 3.4878 10.8279 0.4214 16.2045 3.1657 84.9079 3.4488 10.9054 26.9275 14.7413 8.5316 5.7608 37.8234 2.3096 3.4990 5.3888 0.6855 11.1271 0.8046 3.7329 4.2470 4.0605 11.6233 14.2076 6.4374 14.5217 13.9883 6.3112 3.1184 1.2942 8.1503 10.9456 97.4191 112.7605 21.1643 278.7158 70.1560 88.4956 77.5150 29.7312 79.2769 53.6587 47.7804 62.0367 25.6400 24.5926 3.9398 23.2314 24.8485 78.0475
temp: 298.150 k
press: 1.00000 atm
elementType: 15 7 7 7 6 6 6 6 6 6 6 6 1 1 1 1 1 1 1 1 1 1 1 1 1 1 1 1 1 1
symmnumber: 1
zpe: 681206.6 jmol-1
zpe.correction: 0.259458 hartree
zpe.thermalcorrener: 0.273512 hartree
zpe.thermalcorrenthalpy: 0.274457 hartree
zpe.thermalcorrgfe: 0.217883 hartree
zpe.sumelectzpe: -820.120865 hartree
zpe.sumelectthermal: -820.106811 hartree
zpe.sumelectthermalent: -820.105867 hartree
zpe.sumelectthermalfe: -820.162440 hartree
dipole: 0.3189 0.5429 1.3641
dipole: 1.5024
quadrupole: -77.1103 -79.5331 -83.3717
quadrupole: 0.7047 -2.7181 0.1462
quadrupole: 2.8947 0.4719 -3.3667 0.7047 -2.7181 0.1462
hfenergy: -820.3803232 hartree
pointgroup: C01 [X(C8H18N3P1)]
dipole: -0.0944042 -0.3836367 0.4396661 debye
polarizability: 148.7656827|2.7488194|125.3951569|8.1531355|6.2028018|111.7802822 unknown
InChI: InChI=1S/C8H18N3P/c1-9-7-8-10(2)12(9)11-5-3-4-6-11/h3-8H2,1-2H3
charge 0 multiplicity 1
30 atoms
P  0.50422 0.714876 -0.970512
N  -1.162712 0.75776 -0.283782
N  1.397924 -0.832459 -0.637362
N  1.347326 1.390583 0.480973
C  -2.324149 0.527385 -1.174742
C  -1.566073 0.249539 1.048457
C  -2.890688 -0.861374 -0.739833
C  -2.466345 -1.001629 0.763276
C  2.066016 -0.887095 0.676904
C  2.479577 0.571991 0.950536
C  0.958239 -2.088494 -1.243523
C  1.433094 2.842117 0.664758
H  -2.020365 0.56837 -2.235937
H  -3.086288 1.316835 -1.006109
H  -2.155507 1.026958 1.577654
H  -0.670816 0.039306 1.656295
H  -3.985422 -0.920357 -0.875539
H  -2.432084 -1.662756 -1.34739
H  -1.902228 -1.937757 0.924408
H  -3.342224 -1.022408 1.436283
H  2.951146 -1.551894 0.627649
H  1.397658 -1.265693 1.486791
H  2.648618 0.750499 2.031462
H  3.426895 0.804539 0.408602
H  0.545166 -1.890873 -2.250327
H  0.172835 -2.618295 -0.65265
H  1.815423 -2.780793 -1.360765
H  0.494417 3.313231 0.324289
H  2.281992 3.312732 0.115341
H  1.554351 3.077358 1.740392
