program: Gaussian 09
title: 000268859
version: EM64L-G09RevD.01
frameworkgroup: C1[X(C5H6N4)]
method: RPBEPBE
basis: SDD
operation: Freq
keyword: #p
keyword: freq=noraman
keyword: PBEPBE/SDD
title: #p freq=noraman PBEPBE/SDD
converged: YES YES NO NO
title: Mulliken charges:
elementType: N N N N C C C C C H H H H H H
charge: -0.407322 -0.044378 -0.656941 -0.047973 0.319612 0.061387 0.034767 -0.783616 -0.178243 0.332097 0.230277 0.245562 0.247498 0.332983 0.314292
chargesum: 0.00000
title: Mulliken charges with hydrogens summed into heavy atoms:
elementType: N N N N C C C C C
charge: -0.075226 -0.044378 -0.009666 -0.047973 0.319612 0.061387 0.034767 -0.060280 -0.178243
polarizability: 1.18993985e+02 -2.71004953e+00 7.86450744e+01 8.23726148e-02 2.12104776e-02 3.91908556e+01
1716.lowfreq: -8.7324 -7.0422 -0.0010 -0.0008 -0.0005 8.0800 48.7616 110.6169 127.6881
frequency: 48.7220 110.6155 127.6871 208.1469 226.9572 278.0716 306.3659 348.1193 389.4928 506.1056 508.0061 571.3412 601.3112 646.4894 713.6287 717.3331 736.9170 945.8663 972.7514 1037.0389 1121.5412 1179.5033 1239.7730 1285.2432 1366.4913 1409.5396 1431.1845 1463.3703 1479.2540 1521.1935 1612.8802 1643.2011 2178.1507 2967.8167 3040.6307 3077.1178 3573.5035 3605.8638 3712.5186
redmass: 1.0285 4.7283 7.3320 1.3994 2.6932 2.7669 4.2952 1.1590 4.1066 7.2880 11.1225 5.7918 2.9879 1.5022 5.0174 7.9524 5.9020 2.6023 1.5460 1.3995 3.0247 3.0903 6.6705 5.0801 2.0454 1.3834 3.0177 1.0429 1.1239 3.8235 2.4597 1.6720 12.5940 1.0376 1.0988 1.0970 1.0452 1.0820 1.1044
irintensity: 0.4063 0.0107 2.9944 67.0123 1.5191 85.4915 18.2550 159.6970 2.4695 0.0014 0.1476 1.8195 25.2023 81.1741 2.1750 1.8206 3.2946 6.4168 18.9117 2.6511 46.6047 11.6271 29.6511 33.3469 1.0414 8.0111 6.6132 16.8310 4.1108 12.7556 18.3596 216.8715 74.7169 42.9137 18.7404 14.8917 54.1543 84.5467 30.4862
temp: 298.150 k
press: 1.00000 atm
elementType: 7 7 7 7 6 6 6 6 6 1 1 1 1 1 1
symmnumber: 1
zpe: 292545.2 jmol-1
zpe.correction: 0.111425 hartree
zpe.thermalcorrener: 0.120554 hartree
zpe.thermalcorrenthalpy: 0.121499 hartree
zpe.thermalcorrgfe: 0.077142 hartree
zpe.sumelectzpe: -412.456752 hartree
zpe.sumelectthermal: -412.447623 hartree
zpe.sumelectthermalent: -412.446678 hartree
zpe.sumelectthermalfe: -412.491035 hartree
dipole: 7.2961 2.1153 0.0083
dipole: 7.5965
quadrupole: -59.5940 -44.4293 -54.8275
quadrupole: -3.9127 0.0243 0.0224
quadrupole: -6.6437 8.5209 -1.8772 -3.9127 0.0243 0.0224
hfenergy: -412.5681769 hartree
pointgroup: C01 [X(C5H6N4)]
dipole: -2.9039082 -0.7068675 -0.0000147 debye
dipolederiv: -0.4554862 0.3307223 0.002658 0.5232526 -0.1574856 -0.0010556 0.0088242 -0.0029891 -0.1985721 0.0817218 -0.3349359 -0.0029658 -0.5706025 -0.3469545 -0.0016706 -0.0071743 -0.0003583 -0.1564783 -0.109957 0.0803546 -0.006128 -0.013329 -1.1933277 -0.0079923 -0.006197 -0.0072956 -0.7325584 -0.5891999 -0.0384728 0.0001804 0.1339219 -0.2405585 -0.0000161 0.0020773 0.0002158 -0.2589743 0.2290695 0.2737569 0.0036621 -0.2696857 -0.0201332 0.0029032 -0.0166069 0.0017519 -0.1025443 -0.2046815 -0.193415 -0.0011417 0.0886329 1.2059304 0.0136899 0.0034257 0.0134759 0.0903314 -0.1673254 -0.0828306 -0.0010665 0.4721855 0.097136 0.000748 0.0061997 0.0016936 0.0276962 0.0365307 -0.0439768 -0.0046942 -0.0134584 0.0262278 -0.0032034 0.0068979 -0.0018165 0.1317621 0.7109106 0.0229171 -0.001032 -0.2523393 -0.0584071 -0.0009621 -0.0043919 -0.0014598 0.0495493 0.190369 0.0054442 -0.0001001 -0.0528483 0.2573936 -0.0008306 -0.0005886 0.000292 0.3190103 0.000553 0.0543672 -0.0036269 0.1505626 -0.0682955 0.0104033 -0.0074065 0.0073409 0.1237424 0.0012471 -0.0204802 -0.0012227 -0.0916264 0.0296344 -0.1101812 -0.082018 -0.1007715 -0.0301036 -0.0136469 -0.0244614 0.0107549 -0.0893818 0.0476849 0.101483 0.0927159 0.0935574 -0.045793 0.149088 -0.0331755 0.0017324 -0.0111291 0.2190722 -0.0014624 0.0011251 -0.0024849 0.3940375 0.1408072 0.0041859 0.00299 -0.004155 0.2020827 -0.001853 0.0031174 -0.0011518 0.3888951 unknown
polarizability: 118.6822901|-4.4469505|78.9507747|-0.2782073|0.4653504|39.1968498 unknown
InChI: InChI=1S/C5H6N4/c1-3-5(7)4(2-6)9-8-3/h8H,7H2,1H3
charge 0 multiplicity 1
15 atoms
N  -1.103073 1.434979 0.021303
N  0.258383 1.591366 0.02072
N  -0.260465 -2.051891 -0.022441
N  3.255756 -0.367202 -0.008063
C  -1.54418 0.111528 0.005338
C  -0.366536 -0.667437 -0.005337
C  0.719261 0.2833 0.004554
C  -2.98822 -0.294138 0.004218
C  2.104647 -0.035488 -0.001927
H  -1.684199 2.271084 0.031957
H  -3.653796 0.585913 -0.043016
H  -3.230149 -0.932222 -0.867211
H  -3.257525 -0.85938 0.917205
H  0.654025 -2.493933 -0.035221
H  -1.084928 -2.642678 -0.018679
