program: Gaussian 09
title: 000268848
version: EM64L-G09RevD.01
frameworkgroup: C1[X(C7H5N3O)]
method: RPBEPBE
basis: SDD
operation: Freq
keyword: #pfreq=noraman
keyword: PBEPBE/SDD
title: #p freq=noraman PBEPBE/SDD
converged: NO NO NO NO
title: Mulliken charges:
elementType: O N N N C C C C C C C H H H H H
charge: -0.180102 0.001267 -0.119295 -0.002703 0.077307 0.040723 -0.279337 -0.182520 -0.162166 -0.355819 -0.130125 0.281298 0.245179 0.236422 0.249567 0.280305
chargesum: 0.00000
title: Mulliken charges with hydrogens summed into heavy atoms:
elementType: O N N N C C C C C C C
charge: -0.180102 0.001267 -0.119295 -0.002703 0.077307 0.040723 0.001961 0.062659 0.074256 -0.106252 0.150180
polarizability: 1.50632597e+02 -1.77343551e+00 9.38973543e+01 -5.32633229e-02 -6.32342021e-04 3.91709297e+01
1716.lowfreq: -18.3034 -12.3341 0.0005 0.0006 0.0010 1.6233 49.4094 106.1952 148.2105
frequency: 49.2552 106.1730 148.2054 268.4227 344.7332 400.0981 439.8504 490.6123 578.6626 611.5067 697.1850 713.0129 748.1474 768.3602 806.5107 830.9581 896.1922 906.9091 915.3421 960.1868 970.2789 987.9589 1011.9655 1033.9299 1075.2784 1111.3066 1165.2998 1220.9405 1247.9811 1305.6977 1319.7875 1394.8554 1423.3089 1459.2303 1485.9096 1565.4820 1579.2284 3134.0403 3149.1756 3169.6758 3181.8935 3266.3680
redmass: 6.7466 5.3243 5.9153 5.4837 8.8614 3.4529 7.3625 3.6317 4.0146 7.4281 7.2994 5.1670 1.8337 10.8899 2.3804 1.4377 7.9424 11.7018 1.2998 6.8633 1.4563 5.4581 1.3428 2.7685 1.9388 2.5956 1.0736 1.5970 2.4586 2.1122 10.8762 2.2193 2.2273 6.1824 5.1283 5.8377 5.9493 1.0888 1.0900 1.0957 1.1000 1.1012
irintensity: 0.0001 4.5149 3.0585 1.3247 0.5674 3.5319 4.1085 1.0304 6.9044 3.0787 24.4616 30.8848 36.8590 27.8757 31.0742 20.6890 4.5399 2.9599 0.5126 4.0653 1.9556 29.3353 0.4854 5.4151 8.6075 12.9382 0.2662 2.6860 23.2178 8.3348 6.7386 55.8269 3.1238 55.3749 1.9567 10.7165 11.0807 10.5578 11.6956 16.6186 9.8189 1.8963
temp: 298.150 k
press: 1.00000 atm
elementType: 8 7 7 7 6 6 6 6 6 6 6 1 1 1 1 1
symmnumber: 1
zpe: 292725.7 jmol-1
zpe.correction: 0.111493 hartree
zpe.thermalcorrener: 0.119552 hartree
zpe.thermalcorrenthalpy: 0.120496 hartree
zpe.thermalcorrgfe: 0.077503 hartree
zpe.sumelectzpe: -508.396362 hartree
zpe.sumelectthermal: -508.388304 hartree
zpe.sumelectthermalent: -508.387360 hartree
zpe.sumelectthermalfe: -508.430352 hartree
dipole: 1.9208 3.4278 0.0093
dipole: 3.9293
quadrupole: -44.6294 -66.0181 -64.4808
quadrupole: -5.8191 -0.0368 0.0028
quadrupole: 13.7467 -7.6420 -6.1046 -5.8191 -0.0368 0.0028
hfenergy: -508.5078556 hartree
pointgroup: C01 [X(C7H5N3O1)]
dipole: -0.768068 1.3415964 -0.003968 debye
dipolederiv: -0.8128479 0.1368836 -0.0001894 -0.1002323 -0.3576584 -0.001762 -0.003388 0.0028282 -0.0898092 -0.3388962 -0.0773674 -0.0000142 0.0201592 -0.3052179 -0.000047 -0.0001629 -0.0000572 -0.2128242 -0.7281207 0.0218973 -0.0010597 -0.1304534 -0.3352284 0.001208 -0.000243 -0.0006865 -0.2080951 0.2264988 -0.033054 0.0015405 0.2145027 -0.0737685 0.00183 0.0022754 -0.0008718 -0.1189343 0.3592029 0.0580658 0.0000042 -0.1923014 0.1224429 -0.0001347 0.0008775 0.0001296 0.0776998 0.7716437 0.0706464 0.0000179 0.2101508 0.1176537 -0.0001861 -0.0013776 -0.0003463 0.0689408 -0.2799717 0.0803194 0.0000119 0.140321 -0.058164 0.0000778 0.0004324 0.000073 -0.0921611 0.1694563 -0.1057456 0.0000604 -0.0811754 0.163683 0.0001313 -0.0000072 0.0001527 -0.1233314 0.0431554 0.0515532 0.0001237 -0.184652 -0.1985573 -0.0000864 -0.0001245 -0.0000565 -0.09731 0.0267283 0.0706599 0.0000319 0.3227786 0.3343804 0.0003171 0.0000321 0.0002768 -0.0667851 0.4161939 -0.1889175 -0.0005056 -0.0833919 0.4532457 -0.0015173 0.0041606 0.000097 0.0460311 0.1193203 -0.0589468 -0.0001114 -0.0727486 0.0206146 -0.0000483 -0.0000603 -0.0001106 0.1640826 0.0354199 0.0771857 0.00001 0.0951568 -0.0392039 -0.0000963 0.0000164 -0.000108 0.1496348 -0.1084443 -0.013961 -0.0000818 -0.0048177 0.1024576 -0.0000424 -0.000025 -0.0000391 0.1631074 0.0088905 -0.0767432 -0.0000741 -0.1140968 -0.0481804 -0.0001295 -0.0000998 -0.0001569 0.134584 0.0917708 -0.0124758 0.0002358 -0.0391994 0.1015008 0.0004859 -0.002306 -0.0011242 0.2051698 unknown
polarizability: 150.5952026|2.2948568|93.9347682|-0.0260164|-0.0047671|39.1709106 unknown
InChI: InChI=1S/C7H5N3O/c1-2-4-8-6(3-1)7-9-5-11-10-7/h1-5H
charge 0 multiplicity 1
16 atoms
O  3.177423 -0.642542 0.004643
N  -1.075404 -1.245405 -0.000753
N  1.790688 1.158462 0.002725
N  1.79525 -1.18032 0.001116
C  -0.431183 -0.035513 0.000157
C  1.044431 -0.047855 0.000572
C  -1.113234 1.208935 0.000764
C  -2.523928 1.202314 0.00027
C  -3.202496 -0.036984 -0.000673
C  -2.43585 -1.22779 -0.001122
C  3.045274 0.745763 -0.004714
H  -0.535062 2.136712 0.00156
H  -3.081342 2.144335 0.000688
H  -4.295483 -0.087427 -0.001019
H  -2.923208 -2.2094 -0.001826
H  3.958125 1.33452 -0.004687
