program: Gaussian 09
title: 000268888
version: EM64L-G09RevD.01
frameworkgroup: C1[X(C13H12N4O4S)]
method: RPBEPBE
basis: SDD
operation: Freq
keyword: #p
keyword: freq=noraman
keyword: PBEPBE/SDD
title: #p freq=noraman PBEPBE/SDD
converged: YES YES NO NO
title: Mulliken charges:
elementType: S O O O O N N N N C C C C C C C C C C C C C H H H H H H H H H H H H
charge: 0.295878 -0.187679 -0.274370 -0.211597 -0.206936 -0.424060 -0.062497 0.022538 0.015780 0.301091 -0.514841 0.302229 0.258734 -0.258449 -0.290008 -0.497396 0.446569 -0.656473 -0.368710 -0.281508 -0.138946 -0.508448 0.237160 0.235402 0.300923 0.367678 0.335767 0.227855 0.236867 0.232383 0.293313 0.249060 0.251606 0.271083
chargesum: 0.00000
title: Mulliken charges with hydrogens summed into heavy atoms:
elementType: S O O O O N N N N C C C C C C C C C C C C C
charge: 0.295878 -0.187679 -0.274370 -0.211597 -0.206936 -0.056381 -0.062497 0.022538 0.015780 0.301091 -0.042279 0.302229 0.258734 -0.258449 0.010916 -0.161629 0.446569 0.040633 -0.075397 -0.032448 0.112660 -0.237365
polarizability: 5.13384427e+02 9.29701845e+00 2.61203691e+02 3.08952872e+00 -6.70555378e+00 8.55337484e+01
1716.lowfreq: -5.3564 -0.0012 0.0007 0.0018 3.7399 4.4096 23.2190 37.5503 42.4267
frequency: 23.1538 37.5378 42.4015 53.1785 61.2576 66.0395 80.3757 102.5452 126.9107 156.0681 162.6714 176.1645 190.5957 214.5659 248.3941 295.1936 301.2292 328.5731 357.2557 368.4344 372.5765 410.8276 443.1605 461.0238 479.5915 506.8022 514.5765 563.8340 596.8364 603.1493 633.8818 649.2168 668.9402 671.4117 684.0527 705.0735 711.9539 714.0824 721.8857 752.7139 793.4401 814.6574 831.4157 842.6200 855.1796 862.6980 878.1383 901.7875 915.6979 963.7517 1000.6550 1010.9929 1042.9464 1054.7842 1058.3192 1076.0589 1097.4266 1101.4658 1102.0091 1138.4155 1164.1204 1208.9555 1221.0143 1232.8801 1239.2537 1291.9007 1300.8793 1316.8999 1336.1828 1349.0008 1362.8176 1389.7816 1401.6076 1449.2732 1462.7093 1471.8289 1475.7817 1484.1953 1503.2756 1512.7156 1526.3137 1548.7903 1583.1604 1621.1973 2993.1620 2993.8075 3064.4260 3093.9344 3096.3524 3173.6664 3180.3560 3189.2702 3191.3512 3200.3994 3205.1369 3235.1893
redmass: 6.2350 6.7591 7.4270 5.9163 9.8840 3.0635 9.5691 5.7527 9.2214 7.4501 5.7507 5.2431 1.1979 4.8395 4.2676 6.6652 6.3985 4.5597 5.7412 8.8994 4.8721 6.8899 4.2961 8.1759 5.6193 8.7901 3.6649 3.2427 4.9431 6.3769 7.9708 7.9263 7.7026 5.7559 5.7795 7.9200 1.3883 2.4717 4.9611 12.6098 1.5380 4.0214 1.3537 1.2766 3.1557 1.3834 4.2290 4.1804 1.3710 1.4046 2.9929 1.3162 2.5659 1.9512 1.8687 1.5461 3.3767 1.8714 1.4941 1.3431 9.4501 4.3024 1.7628 1.7691 1.2704 1.6889 1.9021 2.5857 3.0182 4.0072 6.8186 3.7957 1.2709 5.9202 5.4754 2.0053 1.0818 1.1849 2.3305 2.1018 3.1922 5.6575 4.0139 7.3353 1.0371 1.0656 1.0944 1.0995 1.1013 1.0899 1.0894 1.0919 1.0969 1.0963 1.0791 1.1004
irintensity: 1.1250 0.2701 0.2175 0.0992 0.3516 0.1100 1.0823 3.8816 1.4900 1.7874 2.6549 0.9481 0.1167 2.0058 1.7221 0.6737 1.3591 0.6747 2.5680 0.2838 6.2282 5.7039 2.0537 11.8883 1.9911 4.1152 11.6774 0.8847 8.8545 0.7665 9.7863 15.5647 8.0357 7.2082 4.9909 6.6638 76.3125 30.8102 2.0558 8.9795 4.0830 20.9380 8.2900 99.5617 10.3376 11.3227 7.6976 0.8661 0.0383 24.6930 7.0887 0.0348 11.8548 86.5113 15.2745 1.6448 68.8681 5.3466 7.2584 49.3904 382.6306 626.9511 32.0684 140.6487 5.8094 10.0714 83.6123 74.1470 138.9271 137.6789 39.8830 20.3080 13.0022 4.1043 87.1967 12.0883 4.5299 20.0361 151.6367 25.9862 27.2859 44.3686 188.7660 453.5601 18.8958 19.7196 5.1757 41.0320 18.0514 7.3543 4.1030 20.9528 7.8094 0.0895 65.2928 0.2555
temp: 298.150 k
press: 1.00000 atm
elementType: 16 8 8 8 8 7 7 7 7 6 6 6 6 6 6 6 6 6 6 6 6 6 1 1 1 1 1 1 1 1 1 1 1 1
symmnumber: 1
zpe: 632060.0 jmol-1
zpe.correction: 0.240739 hartree
zpe.thermalcorrener: 0.260806 hartree
zpe.thermalcorrenthalpy: 0.261750 hartree
zpe.thermalcorrgfe: 0.189589 hartree
zpe.sumelectzpe: -1418.773382 hartree
zpe.sumelectthermal: -1418.753315 hartree
zpe.sumelectthermalent: -1418.752371 hartree
zpe.sumelectthermalfe: -1418.824533 hartree
dipole: -10.0755 0.2121 -0.0153
dipole: 10.0777
quadrupole: -149.5566 -143.1903 -136.0434
quadrupole: 2.5768 -0.2788 0.4444
quadrupole: -6.6265 -0.2602 6.8867 2.5768 -0.2788 0.4444
hfenergy: -1419.0141213 hartree
pointgroup: C01 [X(C13H12N4O4S1)]
dipole: -3.9642186 0.0728096 -0.0009275 debye
polarizability: 512.2744257|-19.1051329|262.5564464|-2.9142856|-1.7779182|85.2909943 unknown
InChI: InChI=1S/C13H12N4O4S/c1-2-10(13-4-3-7-22-13)14-15-11-6-5-9(16(18)19)8-12(11)17(20)21/h3-8,15H,2H2,1H3
charge 0 multiplicity 1
34 atoms
S  -3.583716 2.24531 -0.015209
O  3.055992 -3.146022 0.060721
O  0.780656 -3.014921 0.085541
O  4.909224 2.85215 -0.099532
O  5.842288 0.764998 -0.074856
N  -0.39321 -0.70028 0.075749
N  -1.500765 0.126947 0.075382
N  1.973591 -2.449914 0.061284
N  4.823256 1.560523 -0.071787
C  -2.701513 -0.451658 0.145552
C  -2.937554 -1.956384 0.215817
C  0.87177 -0.156594 0.039671
C  2.052019 -0.992894 0.032315
C  -3.841415 0.450415 0.110708
C  1.059991 1.264638 0.006778
C  3.344871 -0.425137 -0.003527
C  3.475167 0.967169 -0.034345
C  -2.911662 -2.628395 -1.186233
C  2.334415 1.821405 -0.029858
C  -5.208484 0.152874 0.148337
C  -6.059813 1.307814 0.082549
C  -5.355021 2.500979 -0.006417
H  -3.90978 -2.152497 0.697137
H  -2.180869 -2.430934 0.871398
H  0.165156 1.889449 0.011931
H  -0.421223 -1.74148 0.096323
H  4.225726 -1.072121 -0.007459
H  -1.93937 -2.491427 -1.691991
H  -3.088824 -3.713671 -1.089916
H  -3.695325 -2.204921 -1.838358
H  2.484222 2.903829 -0.054834
H  -5.597459 -0.865709 0.21755
H  -7.150651 1.256351 0.101301
H  -5.742287 3.51701 -0.066126
