program: Gaussian 09
title: 000268878
version: EM64L-G09RevD.01
frameworkgroup: C1[X(C14H19NO)]
method: RPBEPBE
basis: SDD
operation: Freq
keyword: #p
keyword: freq=noraman
keyword: PBEPBE/SDD
title: #p freq=noraman PBEPBE/SDD
converged: YES YES NO NO
title: Mulliken charges:
elementType: O N C C C C C C C C C C C C C C H H H H H H H H H H H H H H H H H H H
charge: -0.183909 -0.177725 -0.186250 -0.433193 -0.392785 -0.387204 -0.504944 0.151728 -0.382919 0.466554 -0.660832 -0.310146 -0.390264 -0.270020 -0.238042 -0.274668 0.214504 0.218479 0.246715 0.187424 0.218158 0.214324 0.208651 0.221734 0.247966 0.199539 0.213806 0.245882 0.239332 0.201330 0.217201 0.222016 0.216920 0.216904 0.223736
chargesum: 0.00000
title: Mulliken charges with hydrogens summed into heavy atoms:
elementType: O N C C C C C C C C C C C C C C
charge: -0.183909 -0.177725 0.028253 0.032002 0.012797 0.035771 -0.035245 0.151728 0.030426 0.466554 0.025713 -0.092946 -0.168248 -0.053100 -0.021138 -0.050932
polarizability: 1.93730806e+02 9.05417396e+00 1.60575770e+02 -2.17172151e+00 -1.05343364e+01 1.16344763e+02
1716.lowfreq: -4.2000 -0.0008 -0.0007 0.0004 7.0950 11.5208 32.6627 41.3626 69.1380
frequency: 32.0195 41.1799 69.1154 89.1933 104.5330 110.3223 169.6342 203.7604 216.7550 265.4964 268.9674 298.0318 320.4330 386.5213 401.0007 417.3778 433.1738 449.8014 484.7959 528.0962 539.8760 602.0366 611.3202 616.6852 691.5230 708.2459 750.1055 751.1129 794.9885 810.2481 824.0092 855.9989 867.1073 878.5260 905.3788 922.3339 951.2776 960.6197 970.3252 977.6517 1025.4433 1037.0772 1042.6873 1076.0244 1079.7606 1081.9756 1092.4474 1108.2735 1118.6869 1137.4517 1171.2473 1189.7928 1204.9499 1216.2170 1232.6176 1250.7379 1265.5047 1272.1886 1292.4957 1309.1329 1334.7404 1336.6253 1338.4614 1341.8993 1347.4758 1379.5662 1388.0838 1393.4713 1440.2528 1450.3929 1462.8017 1469.3789 1470.9813 1483.4096 1484.1178 1495.3603 1504.8042 1577.0829 1617.4371 1626.7532 2944.9886 2959.2429 2967.6060 2981.8288 2982.3655 2987.9658 3006.6329 3034.3350 3036.6001 3044.6058 3061.7837 3069.2643 3084.5481 3100.8356 3119.6289 3126.1326 3153.5972 3160.2555 3170.4092
redmass: 3.2188 4.2307 3.9655 3.2077 3.2652 3.7271 3.0336 1.3230 2.4376 4.1552 4.3475 1.8115 2.5328 3.1318 3.5757 3.0592 3.8976 2.3636 3.1694 3.6586 3.5613 3.2009 3.2343 5.3593 1.7928 2.7017 2.4195 2.0663 1.2419 1.2753 1.7197 2.5164 1.4842 1.4891 2.0561 2.3234 1.3676 2.5392 1.3788 4.4148 3.2018 1.7019 2.3191 1.8841 1.5915 1.3782 1.7324 2.1108 2.9887 2.1868 1.1006 2.0838 1.1207 1.6750 1.4082 1.2987 1.5741 1.2883 1.3291 1.3829 1.3237 1.4208 1.4929 1.4158 1.4422 5.5984 1.6225 1.2422 1.0825 2.5619 1.0545 1.0840 1.0882 1.0478 1.0850 2.2520 1.1463 5.9295 6.5704 9.5390 1.0797 1.0675 1.0646 1.0589 1.0614 1.0400 1.0629 1.0997 1.0954 1.1015 1.0949 1.1016 1.0983 1.1010 1.0845 1.0890 1.0922 1.0932 1.0989
irintensity: 0.1043 2.3012 2.3877 0.7354 0.1140 2.4142 0.8857 0.0794 1.1694 0.6057 0.1553 0.1101 1.2313 1.8421 3.6925 1.7206 7.5680 2.5054 14.6043 3.7491 0.8241 2.2096 3.9525 0.7695 36.9252 3.7885 19.6452 58.0612 19.0451 1.7665 16.3276 2.8878 2.7075 12.0682 4.0822 2.3191 0.2041 7.1351 0.7013 4.2089 0.6790 14.2336 23.4107 1.0227 14.4822 7.8939 3.1575 13.7577 49.0759 5.4395 1.7398 46.2940 8.6944 32.9274 0.8156 0.7005 62.7116 9.4513 7.0506 1.9954 1.5915 4.5469 36.8866 22.4385 6.1274 6.5516 35.4507 27.4205 17.0890 1.0127 9.0654 14.3274 8.5581 3.4101 6.0193 124.3815 36.8507 9.7372 113.4665 156.0062 11.6788 17.0937 38.9571 45.0498 31.7010 41.6223 25.7014 26.2927 50.6335 52.4576 12.7570 33.7020 44.6039 27.8170 8.5946 11.6147 48.9157 49.2017 1.2349
temp: 298.150 k
press: 1.00000 atm
elementType: 8 7 6 6 6 6 6 6 6 6 6 6 6 6 6 6 1 1 1 1 1 1 1 1 1 1 1 1 1 1 1 1 1 1 1
symmnumber: 1
zpe: 786066.2 jmol-1
zpe.correction: 0.299397 hartree
zpe.thermalcorrener: 0.314599 hartree
zpe.thermalcorrenthalpy: 0.315543 hartree
zpe.thermalcorrgfe: 0.256496 hartree
zpe.sumelectzpe: -673.642159 hartree
zpe.sumelectthermal: -673.626957 hartree
zpe.sumelectthermalent: -673.626013 hartree
zpe.sumelectthermalfe: -673.685060 hartree
dipole: 3.2885 0.6973 -2.6813
dipole: 4.3000
quadrupole: -86.2979 -89.7357 -105.1641
quadrupole: -2.5630 -0.5599 -5.5768
quadrupole: 7.4347 3.9969 -11.4315 -2.5630 -0.5599 -5.5768
hfenergy: -673.9415559 hartree
pointgroup: C01 [X(C14H19N1O1)]
dipole: 1.2626938 -0.1866778 -1.1102786 debye
polarizability: 194.7261214|2.7807741|149.769416|-8.1556345|-20.429386|126.1558013 unknown
InChI: InChI=1S/C14H19NO/c1-2-15(12-8-4-3-5-9-12)13-10-6-7-11-14(13)16/h3-5,8-9,13H,2,6-7,10-11H2,1H3
charge 0 multiplicity 1
35 atoms
O  1.150686 1.056004 1.766146
N  -0.215519 0.766957 -0.739825
C  1.178314 0.323232 -0.588017
C  1.472046 -1.032699 -1.305962
C  2.92903 -1.504202 -1.103267
C  3.268032 -1.6214 0.398947
C  3.0968 -0.255533 1.109896
C  1.736429 0.404112 0.865213
C  -0.447429 2.088919 -1.366527
C  -1.294812 0.055236 -0.169825
C  -0.718042 3.225913 -0.353536
C  -1.097101 -1.063407 0.699885
C  -2.648078 0.420178 -0.458221
C  -2.187381 -1.789205 1.217186
C  -3.730544 -0.31408 0.066633
C  -3.518947 -1.432375 0.904106
H  1.803986 1.075496 -1.117881
H  1.2504 -0.894928 -2.380551
H  0.77705 -1.807969 -0.939179
H  3.630692 -0.789815 -1.582957
H  3.074529 -2.478873 -1.606558
H  4.305334 -1.979393 0.53897
H  2.603687 -2.373222 0.869775
H  3.868823 0.445057 0.723427
H  3.249522 -0.327648 2.201301
H  0.447214 2.335657 -1.967825
H  -1.283552 2.018752 -2.089299
H  -1.618807 3.010943 0.246487
H  0.127368 3.33328 0.347275
H  -0.871446 4.185254 -0.88314
H  -0.090325 -1.35156 1.01306
H  -2.866611 1.280043 -1.097265
H  -1.989736 -2.635535 1.885806
H  -4.751652 -0.002016 -0.18329
H  -4.363163 -1.997676 1.311813
