program: Gaussian 09
title: 000268881
version: EM64L-G09RevD.01
frameworkgroup: C1[X(C20H24N2)]
method: RPBEPBE
basis: SDD
operation: Freq
keyword: #pfreq=noraman
keyword: PBEPBE/SDD
title: #p freq=noraman PBEPBE/SDD
converged: YES YES NO NO
title: Mulliken charges:
elementType: N N C C C C C C C C C C C C C C C C C C C C H H H H H H H H H H H H H H H H H H H H H H H H
charge: -0.457548 -0.081424 -0.207318 -0.502330 -0.421145 -0.394147 -0.520391 0.154394 0.444907 0.272440 -0.441832 -0.366944 -0.401143 -0.377562 -0.393777 -0.378146 0.445039 -0.340706 -0.409823 0.440487 -0.814307 -0.810014 0.279488 0.226349 0.226338 0.195155 0.221713 0.214758 0.207297 0.242734 0.253612 0.283688 0.208697 0.272411 0.222114 0.221691 0.245480 0.235602 0.227856 0.227615 0.226437 0.218324 0.223303 0.222248 0.226675 0.231704
chargesum: 0.00000
title: Mulliken charges with hydrogens summed into heavy atoms:
elementType: N N C C C C C C C C C C C C C C C C C C C C
charge: -0.173859 -0.081424 0.072170 -0.049643 -0.004277 0.027908 -0.024045 0.154394 0.444907 0.272440 -0.233135 -0.094533 -0.179029 -0.155871 -0.148297 -0.142544 0.445039 -0.112849 -0.182208 0.440487 -0.146243 -0.129387
polarizability: 3.03017987e+02 -4.89933521e+00 2.71584183e+02 -7.79359028e+00 3.94782828e+00 1.41221253e+02
1716.lowfreq: -8.3453 -6.0613 -3.3549 -0.0008 -0.0004 -0.0002 18.8007 20.3580 24.6738
frequency: 18.5129 19.7053 24.6516 35.2499 44.5514 49.1687 65.5941 83.6785 116.1219 129.1706 149.2975 177.1176 208.6719 237.7113 257.1646 314.9791 319.7824 323.7083 336.9491 348.1952 363.2941 406.0548 410.2901 417.7002 436.3025 450.9782 466.2472 510.5548 515.3234 552.9357 561.1605 618.1897 637.6635 644.4145 661.8750 711.2520 713.0449 727.2233 756.8634 763.2024 807.0938 809.0682 819.3594 822.1687 828.8886 835.7486 837.2008 846.5432 891.2733 921.5827 928.6476 939.5779 957.5759 963.1335 978.8865 984.4081 985.6723 1002.3178 1007.8179 1022.6178 1040.8188 1044.7718 1045.7630 1083.3003 1103.3157 1113.1150 1118.6270 1127.9649 1169.7987 1176.4769 1195.6136 1199.4328 1220.6874 1224.8679 1230.7859 1256.8844 1264.6227 1277.0646 1298.4302 1303.3484 1308.5276 1322.9182 1331.1703 1338.7054 1349.0493 1351.1675 1354.3173 1363.3947 1394.5828 1397.6509 1410.3366 1418.1451 1454.3474 1456.8237 1464.9145 1470.4069 1470.5743 1472.8829 1474.6642 1478.1673 1488.4776 1493.2684 1521.7591 1568.7045 1585.6232 1618.5216 1635.4216 1649.9570 2967.5389 2971.6556 2973.3477 2975.3252 2976.5268 2989.2230 2990.8633 3032.5897 3041.5112 3043.4668 3050.6870 3050.7530 3073.2528 3075.0496 3081.6098 3099.0569 3111.7327 3115.3739 3119.4997 3127.4677 3140.5334 3151.1956 3154.9677 3557.2740
redmass: 1.8647 1.6354 2.9061 1.0670 3.9207 3.6017 3.9680 4.2138 3.5900 3.8341 3.7043 4.2093 3.5925 2.8250 3.0329 3.2957 2.6084 2.1810 3.1678 1.8158 1.6588 2.9262 2.9658 3.7109 3.0533 3.7269 3.1821 2.5344 3.1689 4.6287 3.7565 3.6891 6.5009 4.5316 3.4423 3.2652 2.9344 3.3451 3.8964 3.6357 1.9492 1.5645 3.2176 1.6338 1.4087 1.3683 2.5598 2.9666 2.0137 1.7005 1.3297 1.3429 1.3544 1.3621 2.1646 1.4454 1.6672 2.9494 2.7101 1.8700 1.9379 1.5116 1.5339 1.5051 1.5698 1.7803 1.6676 1.3236 1.8216 1.3618 1.1547 1.8441 2.7744 2.4665 1.6733 1.4857 1.6598 1.4212 1.3332 1.4152 1.6859 1.5496 1.4118 1.3940 1.4918 1.5271 4.2382 3.1371 1.2300 1.2336 3.5283 3.3397 1.0953 1.2216 1.1986 1.0515 1.0503 1.0844 1.0983 1.1037 1.2783 2.5753 3.0172 5.9348 4.8384 6.4122 6.4084 9.6127 1.0375 1.0647 1.0376 1.0712 1.0683 1.0626 1.0693 1.0958 1.1009 1.0970 1.0997 1.0995 1.0986 1.0985 1.0987 1.0868 1.0893 1.0873 1.0886 1.0961 1.0960 1.0952 1.0958 1.0763
irintensity: 0.0061 0.4121 0.1922 0.4992 1.3016 0.2627 0.0607 1.2791 2.9795 1.9196 0.3008 0.5988 0.3676 5.2343 1.2655 0.6396 1.8153 9.4485 3.5966 82.4565 4.6711 1.2321 0.3806 0.4663 0.8222 16.1009 2.4136 9.3836 24.1295 2.9316 5.2044 7.9137 0.8975 1.1307 1.7023 1.4153 1.8988 10.8720 3.8770 6.8771 8.6751 54.6386 5.6612 32.0729 25.1936 20.5951 1.2241 3.2175 3.7904 23.6192 0.4110 2.5032 0.4474 0.2453 11.4983 0.2740 14.8635 0.0997 3.4967 12.1094 1.2556 10.6099 14.2361 3.5773 3.6396 5.0485 11.1628 16.0905 48.5233 2.7586 10.3680 10.7599 0.6552 1.9244 4.6897 0.8521 12.6904 0.5554 6.4000 6.3563 48.1885 41.3545 0.9858 1.5193 21.1205 2.1201 4.3593 72.1334 2.4763 6.4902 0.1403 12.9650 10.7941 32.4108 20.5302 10.1647 15.8346 11.7428 9.5357 19.1175 1.4372 83.9467 260.3249 4.5120 7.6026 15.5851 118.5624 138.0526 67.7567 26.1264 51.9615 18.4041 23.3894 12.3449 52.6058 67.3203 30.4746 28.5789 24.2235 70.1421 19.5017 21.7781 19.9288 20.7953 23.9536 15.4936 27.0715 30.4484 22.8220 1.1289 6.8630 18.9076
temp: 298.150 k
press: 1.00000 atm
elementType: 7 7 6 6 6 6 6 6 6 6 6 6 6 6 6 6 6 6 6 6 6 6 1 1 1 1 1 1 1 1 1 1 1 1 1 1 1 1 1 1 1 1 1 1 1 1
symmnumber: 1
zpe: 1021520.0 jmol-1
zpe.correction: 0.389076 hartree
zpe.thermalcorrener: 0.410342 hartree
zpe.thermalcorrenthalpy: 0.411286 hartree
zpe.thermalcorrgfe: 0.335296 hartree
zpe.sumelectzpe: -884.428479 hartree
zpe.sumelectthermal: -884.407213 hartree
zpe.sumelectthermalent: -884.406269 hartree
zpe.sumelectthermalfe: -884.482259 hartree
dipole: 1.0493 2.8040 1.3372
dipole: 3.2790
quadrupole: -124.7454 -112.9501 -136.6746
quadrupole: -3.5324 -0.4464 0.9018
quadrupole: 0.0446 11.8399 -11.8845 -3.5324 -0.4464 0.9018
hfenergy: -884.817555 hartree
pointgroup: C01[X(C20H24N2)]
dipole: -0.4800482 0.9605033 -0.7150065 debye
polarizability: 301.538625|2.7538189|264.8442126|-15.8941279|-30.0088936|149.4405855 unknown
InChI: InChI=1S/C20H24N2/c1-15-7-11-17(12-8-15)21-19-5-3-4-6-20(19)22-18-13-9-16(2)10-14-18/h7-14,19,21H,3-6H2,1-2H3
charge 0 multiplicity 1
46 atoms
N  2.079732 1.691043 -0.370184
N  -0.915787 0.448384 0.817427
C  0.893515 2.028566 0.426281
C  0.598348 3.550071 0.310767
C  0.13672 3.957981 -1.111351
C  -1.091369 3.134055 -1.567297
C  -0.826538 1.603575 -1.446316
C  -0.362681 1.266967 -0.03693
C  2.830421 0.512909 -0.22153
C  -2.14268 -0.241902 0.598688
C  4.047666 0.359876 -0.945691
C  2.419629 -0.547914 0.637867
C  4.825145 -0.807298 -0.809093
C  3.21634 -1.704954 0.761549
C  -2.165142 -1.656742 0.734681
C  -3.36943 0.43825 0.367571
C  4.43046 -1.867776 0.046605
C  -3.37453 -2.366074 0.605754
C  -4.578485 -0.28425 0.264044
C  -4.606688 -1.696979 0.372368
C  5.26475 -3.131111 0.182273
C  -5.90846 -2.473712 0.271143
H  1.060056 1.763041 1.489891
H  1.499162 4.119596 0.612687
H  -0.20019 3.798518 1.035825
H  0.960011 3.816701 -1.841311
H  -0.106304 5.0376 -1.123947
H  -1.353054 3.382467 -2.61322
H  -1.966838 3.402957 -0.942067
H  -0.0110 1.329186 -2.144537
H  -1.722595 1.023125 -1.722558
H  2.492323 2.433699 -0.934267
H  4.385827 1.163966 -1.613151
H  1.481024 -0.472715 1.195519
H  5.759311 -0.89395 -1.378403
H  2.880288 -2.505009 1.434171
H  -1.225165 -2.181259 0.935713
H  -3.375057 1.532454 0.299754
H  -3.36632 -3.459381 0.698665
H  -5.515516 0.261019 0.096305
H  4.753752 -4.007288 -0.262571
H  6.239869 -3.02456 -0.324988
H  5.463613 -3.376456 1.242555
H  -6.743214 -1.824023 -0.044236
H  -5.830335 -3.301551 -0.4580
H  -6.185878 -2.923702 1.243949
