program: Gaussian 09
title: 000268831
version: EM64L-G09RevD.01
frameworkgroup: C1[X(C20H25NS2)]
method: RPBEPBE
basis: SDD
operation: Freq
keyword: #p
keyword: freq=noraman
keyword: PBEPBE/SDD
title: #p freq=noraman PBEPBE/SDD
converged: YES YES NO NO
title: Mulliken charges:
elementType: S S N C C C C C C C C C C C C C C C C C C C C H H H H H H H H H H H H H H H H H H H H H H H H H
charge: 0.176255 0.107375 0.009623 0.028452 -0.389960 -0.444858 -0.404278 -0.416665 -0.390071 -0.697554 -0.690759 -0.163618 -0.158579 -0.249388 -0.217508 -0.235865 -0.288854 -0.213261 -0.217987 -0.218235 -0.208992 -0.231028 -0.240441 0.203577 0.210726 0.209776 0.194465 0.233870 0.203872 0.191720 0.197758 0.203753 0.193102 0.200723 0.275762 0.307072 0.281564 0.287384 0.253770 0.237554 0.249153 0.251333 0.229140 0.226930 0.229052 0.226216 0.229749 0.228174
chargesum: 0.00000
title: Mulliken charges with hydrogens summed into heavy atoms:
elementType: S S N C C C C C C C C C C C C C C C C C C C C
charge: 0.176255 0.107375 0.009623 0.232029 0.030542 -0.016522 -0.008686 -0.015153 0.003754 -0.114721 -0.121811 -0.163618 -0.158579 0.004382 0.020046 0.013288 -0.037522 0.015880 0.008943 0.010817 0.017224 -0.001279 -0.012267
polarizability: 3.34525702e+02 1.09900885e+01 2.37930855e+02 -1.89163300e+01 -4.61596033e+00 2.06284012e+02
1716.lowfreq: -12.7525 -4.7223 -3.8220 -0.0015 -0.0010 0.0014 12.7801 19.8213 23.5132
frequency: 6.6195 19.3529 23.2790 36.3178 37.5928 42.9966 50.1294 67.4950 83.4191 98.0536 155.4469 170.6800 198.8555 227.9903 239.3276 259.1351 280.1960 285.8740 295.4532 335.8456 371.8894 389.4160 392.9755 405.7339 405.9607 424.2949 433.7742 447.4884 478.0741 485.4754 491.9967 541.9234 555.2511 610.5250 610.9082 629.3465 675.6467 678.3054 694.3806 697.4376 747.2004 753.9699 770.3408 786.9293 837.5779 842.5982 852.8453 866.6525 888.1564 897.6285 898.6718 909.5038 922.5421 925.7346 932.0886 969.9863 979.4632 984.4133 985.7330 989.6764 996.4299 1000.6369 1014.5702 1015.2629 1053.5754 1054.7721 1066.1297 1068.7390 1069.6076 1073.0772 1079.4574 1097.1366 1111.8599 1142.5109 1158.6016 1169.9499 1170.4121 1179.5443 1182.0764 1194.1997 1228.0965 1243.7824 1257.3296 1263.2796 1268.9770 1284.1186 1296.5525 1298.6990 1311.0848 1317.0718 1333.1918 1337.1420 1340.5009 1343.4138 1355.7858 1369.7034 1371.7884 1377.8272 1423.6591 1423.7724 1441.1456 1453.1968 1456.3916 1458.6657 1462.7261 1464.7422 1467.8133 1472.4327 1481.2763 1579.5406 1583.9870 1586.6148 1586.8846 2897.0649 2966.4676 2967.9278 2968.8630 2970.6209 2989.6574 3004.6015 3031.1833 3032.1997 3039.7649 3044.1898 3053.7229 3055.6539 3118.4351 3123.7054 3124.5146 3130.2108 3133.8333 3143.6128 3147.2753 3151.8017 3156.6769 3157.4587 3165.8674 3168.2887
redmass: 5.4692 5.3211 5.9585 4.1534 3.8091 4.3057 3.4176 6.3669 6.0746 3.8154 3.8604 4.3445 4.2511 2.4277 3.0112 4.2283 5.2192 4.3046 3.2548 1.9812 3.4710 8.5233 5.9780 3.0285 2.8896 2.3339 3.1095 4.9723 2.8556 2.2066 2.3738 3.8826 2.6573 6.4638 6.4627 5.5038 6.6863 6.6847 2.1885 2.1499 1.5225 1.5312 2.2766 1.4452 3.0611 1.2473 1.2455 1.6609 1.6034 1.4140 2.3820 1.3816 1.5641 1.9898 1.7121 1.3931 1.3992 6.1055 6.0245 1.3090 1.3189 2.3207 3.3322 3.2760 1.6870 1.3599 2.0246 1.6270 1.9109 1.8708 1.7316 1.7393 2.5129 2.3194 1.6828 1.0527 1.0542 1.1141 1.1268 1.3134 1.2327 1.2403 1.2586 1.2634 1.1750 1.3848 1.3255 1.3362 1.2391 1.4130 1.4598 1.5133 1.5381 1.4737 1.5259 7.6182 8.6438 1.5268 2.1420 2.0880 1.1054 1.2667 1.9538 1.7385 1.0885 1.0903 1.1122 1.0860 1.0945 6.1189 6.2724 5.9907 6.0351 1.0822 1.0648 1.0631 1.0623 1.0618 1.0615 1.0633 1.0958 1.0970 1.0993 1.1025 1.1025 1.0613 1.1008 1.0844 1.0846 1.0877 1.0884 1.0924 1.0933 1.0964 1.1058 1.0966 1.1016 1.1007
irintensity: 0.5722 0.2497 0.2516 0.0989 0.2697 0.1901 0.0270 0.2460 0.5004 0.8725 7.6077 2.3925 2.4388 0.1720 0.0877 10.8094 0.5368 5.4443 0.8049 5.6051 0.9398 2.4613 3.4979 0.8762 0.3164 3.9166 3.8575 132.3060 1.1478 6.9558 17.6887 40.9367 56.1753 0.4642 0.2146 82.7232 16.0923 10.6847 35.2572 43.7231 71.7839 60.3784 5.4049 1.1752 2.5605 0.2953 1.2058 15.5616 30.3028 4.9980 11.6812 0.7491 30.1951 8.3544 17.8875 0.0834 0.7003 3.2259 3.6347 0.0631 0.1234 1.7917 39.3837 7.5086 1.2411 7.3154 56.0813 6.3140 26.0709 14.9533 11.7883 51.6529 2.6953 40.6095 191.3007 0.0863 0.0087 0.3301 1.1383 8.9763 111.0121 16.0007 1.9504 31.5250 23.4227 20.9738 1.3495 2.5981 2.2495 2.3081 20.5387 31.4321 0.3415 1.0150 30.7838 0.4990 0.9030 13.9356 8.7653 7.3728 29.6386 4.1861 46.3728 21.0524 6.8013 9.8794 11.6653 11.2444 2.0313 2.7323 1.6607 41.0309 5.4862 34.3838 49.3263 5.0094 36.2470 37.7681 25.2858 13.0929 72.5847 64.4416 11.8415 31.1406 68.2086 13.4508 7.6406 3.3941 0.4074 2.8150 5.7096 17.8068 20.8905 29.7427 5.3770 28.4418 23.6593 14.1043
temp: 298.150 k
press: 1.00000 atm
elementType: 16 16 7 6 6 6 6 6 6 6 6 6 6 6 6 6 6 6 6 6 6 6 6 1 1 1 1 1 1 1 1 1 1 1 1 1 1 1 1 1 1 1 1 1 1 1 1 1
symmnumber: 1
zpe: 1050679.6 jmol-1
zpe.correction: 0.400183 hartree
zpe.thermalcorrener: 0.422839 hartree
zpe.thermalcorrenthalpy: 0.423783 hartree
zpe.thermalcorrgfe: 0.343187 hartree
zpe.sumelectzpe: -1626.278726 hartree
zpe.sumelectthermal: -1626.256070 hartree
zpe.sumelectthermalent: -1626.255126 hartree
zpe.sumelectthermalfe: -1626.335722 hartree
dipole: 3.3492 0.4620 0.8244
dipole: 3.4800
quadrupole: -145.6615 -157.8747 -142.6228
quadrupole: 7.6984 -4.6401 0.8197
quadrupole: 3.0582 -9.1550 6.0969 7.6984 -4.6401 0.8197
hfenergy: -1626.6789087 hartree
pointgroup: C01 [X(C20H25N1S2)]
dipole: -1.242756 -0.5374461 0.2029838 debye
polarizability: 326.6924339|24.1005324|238.4198612|22.8670702|18.0965606|213.6282744 unknown
InChI: InChI=1S/C20H25NS2/c1-4-10-18(11-5-1)21(16-22-19-12-6-2-7-13-19)17-23-20-14-8-3-9-15-20/h2-3,6-9,12-15,18H,1,4-5,10-11,16-17H2
charge 0 multiplicity 1
48 atoms
S  -0.21163 1.941566 0.65141
S  2.988008 -1.123967 -1.202676
N  0.192531 -0.672343 -0.459473
C  -0.437984 -2.029086 -0.341391
C  -1.943707 -1.911822 0.013787
C  -0.272496 -2.884297 -1.620464
C  -2.581199 -3.305899 0.221288
C  -0.903469 -4.285315 -1.423828
C  -2.395569 -4.196905 -1.028754
C  0.33469 0.08381 0.770026
C  1.14201 -0.372489 -1.471869
C  -2.036393 1.747733 0.47859
C  3.817513 0.236668 -0.28051
C  -2.85055 1.654596 1.63363
C  3.864446 1.557512 -0.793683
C  -2.62616 1.723416 -0.807637
C  4.466261 -0.06178 0.945347
C  -4.252519 1.525488 1.500085
C  4.528315 2.574853 -0.070692
C  -4.0297 1.599222 -0.937346
C  5.148943 0.954658 1.651596
C  -4.844035 1.496523 0.214605
C  5.174651 2.278425 1.152262
H  0.072267 -2.580908 0.483913
H  -2.087409 -1.294147 0.919797
H  -2.455216 -1.377803 -0.810737
H  -0.771333 -2.375077 -2.471056
H  0.797558 -2.999084 -1.876042
H  -3.656186 -3.19084 0.458012
H  -2.11249 -3.801371 1.097279
H  -0.345619 -4.826139 -0.631787
H  -0.78473 -4.873779 -2.353737
H  -2.972691 -3.765601 -1.872685
H  -2.802072 -5.210151 -0.845091
H  -0.254852 -0.370489 1.578374
H  1.388889 0.187567 1.088909
H  0.871572 -0.783592 -2.45143
H  1.306994 0.71464 -1.535247
H  -2.386886 1.694663 2.62526
H  3.402872 1.787022 -1.760555
H  -1.987321 1.803663 -1.692622
H  4.431183 -1.083457 1.338596
H  -4.879834 1.456457 2.395996
H  4.550846 3.594522 -0.47152
H  -4.483753 1.584726 -1.93465
H  5.651261 0.712993 2.595293
H  -5.931133 1.40264 0.112581
H  5.695227 3.067172 1.706448
