program: Gaussian 09
title: 000268817
version: EM64L-G09RevD.01
frameworkgroup: C1[X(C18H21Cl2NS2)]
method: RPBEPBE
basis: SDD
operation: Freq
keyword: #p
keyword: freq=noraman
keyword: PBEPBE/SDD
title: #p freq=noraman PBEPBE/SDD
converged: YES YES NO NO
title: Mulliken charges:
elementType: Cl Cl S S N C C C C C C C C C C C C C C C C C C H H H H H H H H H H H H H H H H H H H H H
charge: -0.060802 -0.056923 0.165780 0.182482 0.009537 0.300354 -0.698031 -0.653172 -0.750205 -0.637076 -0.688055 -0.238278 -0.214412 -0.245425 -0.204120 -0.169935 -0.217078 -0.200194 -0.205352 -0.212397 -0.202260 -0.098709 -0.099035 0.226934 0.208086 0.220894 0.236118 0.231737 0.201240 0.262257 0.219643 0.222647 0.301164 0.263545 0.281681 0.264747 0.253381 0.250081 0.248969 0.272305 0.257012 0.256830 0.256013 0.258021
chargesum: 0.00000
title: Mulliken charges with hydrogens summed into heavy atoms:
elementType: Cl Cl S S N C C C C C C C C C C C C C C C C C C
charge: -0.060802 -0.056923 0.165780 0.182482 0.009537 0.300354 -0.042116 0.015923 -0.045658 -0.072367 -0.141627 -0.238278 -0.214412 0.007956 0.045961 0.079034 0.055226 0.056818 0.051478 0.043616 0.055761 -0.098709 -0.099035
polarizability: 3.85738390e+02 4.82716171e-01 2.56509948e+02 6.92566058e+00 1.75920017e+01 1.79511857e+02
1716.lowfreq: -8.0696 -4.1114 -0.0023 -0.0023 -0.0019 4.2440 10.3539 12.1437 28.8530
frequency: -4.7233 11.9833 28.8072 32.9586 39.8584 44.1013 57.7698 68.2418 86.1947 104.5749 128.8832 144.2741 196.3824 203.4759 204.1079 213.5702 253.7540 273.9519 287.5807 298.1458 305.0393 313.8446 316.2285 322.0320 330.9473 336.3569 351.6575 371.3430 408.5243 409.8139 413.4163 445.4876 469.5046 479.1706 488.6494 495.5449 498.3944 504.7737 536.8879 598.1766 619.4088 620.5924 669.6290 697.3473 699.0822 713.1795 713.8471 816.9097 819.1771 824.5423 825.9306 828.7465 876.7319 906.5974 922.4281 924.5646 942.5669 944.4931 946.6973 959.7512 964.1955 990.0351 991.1157 1021.3554 1025.3051 1060.6076 1063.1778 1066.5678 1070.5828 1072.1742 1097.6913 1099.3922 1151.9354 1177.1541 1179.2211 1198.0021 1211.7176 1228.8110 1246.0100 1259.5938 1281.4356 1282.3095 1317.6139 1341.0180 1348.7296 1353.2512 1375.1933 1377.5370 1378.8787 1381.0601 1402.5950 1430.9765 1448.8084 1452.2377 1453.6841 1459.5462 1464.9167 1475.2294 1484.2827 1490.6599 1503.3585 1570.2455 1571.7116 1572.7573 1573.3906 2983.0254 2983.7515 2988.9735 3025.0825 3056.6184 3077.2084 3080.9358 3083.9350 3091.5251 3094.5626 3101.4457 3141.2112 3141.5487 3146.7601 3147.4725 3149.1895 3154.6106 3169.0490 3169.7450 3173.0325 3175.1178
redmass: 7.5083 6.5361 5.3440 4.7453 5.2406 3.8130 4.2857 9.6875 5.0834 5.7286 5.1817 5.1308 6.2196 1.5954 4.8594 4.0551 2.7965 1.1850 2.9863 5.4068 2.8929 1.7237 4.1588 4.4241 5.2778 4.3757 2.8647 2.4135 2.8972 2.8077 2.4273 2.6213 3.6546 3.2696 3.4590 3.4041 5.1035 6.8716 4.6521 5.8163 7.1589 7.1821 3.2490 3.9534 4.0274 7.0926 7.0887 1.4164 1.3777 1.2906 1.7982 1.5990 1.6051 1.7148 1.8846 1.5883 1.3141 1.2244 1.3276 1.3588 1.3724 5.4526 5.3878 1.4320 1.3871 2.5163 6.3024 3.8601 2.0337 1.9752 1.3715 1.3756 1.8370 1.1197 1.1195 2.0761 1.4147 2.9297 1.4614 1.2094 1.2435 1.2429 2.5057 1.7224 4.1994 4.1767 1.2029 1.2378 3.8347 4.1572 1.2094 1.0942 1.1680 2.1412 1.9276 1.0593 1.0576 1.0573 1.0546 1.0572 1.0581 7.6358 6.6713 7.3364 6.3994 1.0354 1.0357 1.0370 1.0650 1.0574 1.0991 1.0990 1.0999 1.1005 1.0989 1.1002 1.0894 1.0893 1.1041 1.0888 1.1065 1.0889 1.0958 1.0962 1.0971 1.0977
irintensity: 0.0807 0.0847 0.0884 0.3250 0.4851 0.3303 0.0860 0.3634 0.6792 0.4734 2.5950 2.3514 17.5037 0.6035 7.5012 0.1919 3.3039 2.3232 2.6823 4.2100 1.3966 0.6781 0.6222 0.1505 1.8831 0.9115 0.7620 1.5716 0.0974 4.5591 17.6133 58.1740 22.8972 39.1258 13.8358 17.6988 67.1302 30.9971 66.7357 94.7740 1.4978 1.6187 3.2291 2.5654 0.3076 4.5684 8.7049 39.0264 51.6407 10.3340 9.8679 20.3912 52.1552 3.4485 27.8928 5.0851 0.7313 1.9886 0.1284 0.0646 0.3964 136.7326 37.8099 21.9928 7.8700 66.3768 13.5319 38.5468 69.6280 50.3009 7.8914 10.3977 242.7637 1.5652 1.0746 72.0407 32.8924 29.0214 24.0967 31.7058 4.1228 1.2329 141.9871 19.5843 2.1303 3.2764 18.8725 29.1035 6.6319 4.9407 15.4843 10.2924 5.9236 124.8024 75.4419 1.6039 4.1775 8.6190 5.3294 12.9586 8.5116 0.5990 5.1896 1.6137 1.9579 15.5848 20.1450 17.9030 37.2514 20.4652 12.2201 18.0078 14.3393 25.9236 44.4012 15.6345 6.2230 3.5821 13.6839 3.3506 1.8212 1.0977 7.0514 5.4233 1.4689 1.1350
temp: 298.150 k
press: 1.00000 atm
elementType: 17 17 16 16 7 6 6 6 6 6 6 6 6 6 6 6 6 6 6 6 6 6 6 1 1 1 1 1 1 1 1 1 1 1 1 1 1 1 1 1 1 1 1 1
symmnumber: 1
zpe: 899875.9 jmol-1
zpe.correction: 0.342745 hartree
zpe.thermalcorrener: 0.366681 hartree
zpe.thermalcorrenthalpy: 0.367625 hartree
zpe.thermalcorrgfe: 0.286522 hartree
zpe.sumelectzpe: -2467.783652 hartree
zpe.sumelectthermal: -2467.759715 hartree
zpe.sumelectthermalent: -2467.758771 hartree
zpe.sumelectthermalfe: -2467.839874 hartree
dipole: 0.3627 -3.5118 2.5774
dipole: 4.3712
quadrupole: -187.8204 -155.2529 -171.6310
quadrupole: -1.1996 5.0611 -2.0250
quadrupole: -16.2523 16.3152 -0.0629 -1.1996 5.0611 -2.0250
hfenergy: -2468.1263962 hartree
pointgroup: C01 [X(C18H21Cl2N1S2)]
dipole: 0.1264331 1.6163955 -0.5734155 debye
polarizability: 385.8352232|3.2264426|240.5956886|-4.4344603|35.7948027|195.3292829 unknown
InChI: InChI=1S/C18H21Cl2NS2/c1-18(2,3)21(12-22-16-8-4-14(19)5-9-16)13-23-17-10-6-15(20)7-11-17/h4-11H,12-13H2,1-3H3
charge 0 multiplicity 1
44 atoms
Cl -6.974139 -1.41832 -1.154002
Cl 6.10718 -2.267455 -1.513425
S  -1.124789 -0.126358 1.316536
S  2.028828 1.113354 2.197052
N  0.126244 2.326925 0.300884
C  0.221331 2.162319 -1.205844
C  0.96006 3.394319 -1.800176
C  0.975996 0.861191 -1.592822
C  -1.20495 2.125222 -1.810116
C  -1.009148 1.872319 1.029075
C  1.305978 2.586023 1.082717
C  -2.787622 -0.449876 0.604129
C  3.166578 0.190254 1.091499
C  -2.933892 -1.443938 -0.397639
C  4.366714 0.780096 0.621979
C  -3.938958 0.236952 1.069643
C  2.872748 -1.157141 0.766929
C  -4.206892 -1.751641 -0.928799
C  5.262194 0.03926 -0.18251
C  -5.214803 -0.044006 0.529508
C  3.770008 -1.914579 -0.020271
C  -5.328085 -1.037984 -0.461715
C  4.948035 -1.300103 -0.487907
H  0.48559 4.33443 -1.466951
H  2.029889 3.420695 -1.526712
H  0.912911 3.350001 -2.902799
H  0.476152 -0.021564 -1.159264
H  2.018015 0.87856 -1.231218
H  0.999216 0.755783 -2.693394
H  -1.772602 1.235581 -1.488212
H  -1.780486 3.03422 -1.5556
H  -1.117149 2.079543 -2.909509
H  -1.965891 2.095008 0.540406
H  -0.985898 2.266612 2.055983
H  1.098632 3.310096 1.889582
H  2.140917 2.940097 0.46593
H  -2.051064 -1.977996 -0.763879
H  4.616359 1.809542 0.900922
H  -3.849021 0.973001 1.875881
H  1.94009 -1.605566 1.122534
H  -4.318733 -2.522662 -1.696669
H  6.190511 0.489471 -0.545754
H  -6.101485 0.485882 0.8897
H  3.549832 -2.956667 -0.269198
