program: Gaussian 09
title: 000268808
version: EM64L-G09RevD.01
frameworkgroup: C1[X(C17H26N2O4)]
method: RPBEPBE
basis: SDD
operation: Freq
keyword: #p
keyword: freq=noraman
keyword: PBEPBE/SDD
title: #p freq=noraman PBEPBE/SDD
converged: YES YES NO NO
title: Mulliken charges:
elementType: O O O O N N C C C C C C C C C C C C C C C C C H H H H H H H H H H H H H H H H H H H H H H H H H H
charge: -0.247576 -0.239405 -0.438966 -0.432303 -0.114551 -0.255913 -0.484630 -0.508416 0.344223 0.382013 -0.338752 -0.337881 -0.326167 -0.331064 -0.635675 -0.324431 -0.320411 -0.325653 -0.322613 -0.055596 -0.071268 0.173913 -0.877724 0.214957 0.235183 0.233804 0.224570 0.224435 0.198154 0.189204 0.209660 0.245493 0.218270 0.214973 0.224508 0.279271 0.212790 0.187189 0.188481 0.211791 0.225393 0.204822 0.198859 0.224315 0.300346 0.219055 0.228347 0.404781 0.370194
chargesum: 0.00000
title: Mulliken charges with hydrogens summed into heavy atoms:
elementType: O O O O N N C C C C C C C C C C C C C C C C C
charge: -0.247576 -0.239405 -0.034185 -0.062109 -0.114551 -0.255913 -0.034490 -0.050042 0.344223 0.382013 0.083837 0.060983 0.137596 0.108417 -0.356404 0.075547 0.079861 0.104562 0.100561 -0.055596 -0.071268 0.173913 -0.129977
polarizability: 2.61207924e+02 5.81326742e+00 2.16011953e+02 -1.32260567e+00 1.50266540e+01 1.62371947e+02
1716.lowfreq: -8.6485 -4.6686 -0.0009 -0.0007 -0.0005 6.1150 21.4613 30.1780 46.2364
frequency: 20.5555 29.4763 46.2099 54.4863 65.1055 66.2245 115.1101 134.8189 142.3895 146.2439 181.5061 190.2352 213.4826 229.8862 245.3679 254.6285 285.5645 294.0971 295.5347 311.1401 320.5665 335.8310 342.2767 364.9383 377.0262 397.6426 430.8998 448.7506 456.7406 467.2968 470.4401 490.7035 516.2030 541.8522 568.3023 598.6928 616.8377 651.5729 665.3635 718.4550 752.0974 771.2185 779.8565 805.7268 807.7316 838.5599 841.6239 843.8417 892.3675 898.4611 921.6245 955.8765 982.8752 990.0450 997.9033 1004.4722 1024.9079 1026.8410 1028.1768 1040.0341 1049.9263 1052.6577 1078.3553 1083.8616 1090.0462 1101.6451 1105.1409 1112.2587 1120.3647 1123.7706 1146.4254 1154.3258 1166.4811 1187.5331 1195.9339 1211.9141 1216.7710 1230.8817 1234.5507 1262.8994 1268.2482 1279.8143 1286.7020 1290.9435 1295.1030 1318.4083 1326.0624 1333.3737 1338.7243 1340.4403 1355.1883 1356.6584 1365.3922 1368.8227 1373.0990 1377.8962 1390.9119 1396.3902 1427.3894 1441.0139 1442.9073 1447.6912 1449.1357 1449.5527 1450.1967 1456.3202 1458.1486 1459.6622 1464.9166 1474.7741 1481.9275 1492.3218 1527.7622 1624.3832 1636.8741 2420.4464 2860.3065 2869.9661 2907.5927 2928.1695 2935.6833 2940.8658 2948.0670 2950.0074 2952.5221 2952.9534 2960.1122 2984.0030 2993.6731 3016.7342 3022.8334 3036.4503 3040.1303 3054.5737 3078.0670 3081.2839 3086.5970 3091.3357 3102.0218 3122.0249 3570.2461
redmass: 3.7676 5.7553 3.3956 3.9274 3.4539 4.7413 4.1433 3.5891 1.1409 3.4647 4.4855 3.6425 4.1445 2.7342 1.9161 2.3153 2.9132 3.1136 2.7968 2.2486 2.5314 2.6969 1.4831 4.2654 3.1631 1.9033 2.8624 5.8095 4.3008 2.8534 2.8733 6.0884 3.6007 5.6223 2.8847 2.1083 2.4481 5.6908 4.4366 5.7965 4.3401 3.9108 3.9714 3.7949 3.6605 2.0062 1.5994 2.0238 2.3406 2.3281 1.3844 3.1199 2.5555 2.3662 1.9231 2.6792 2.1658 2.1092 2.1350 1.4747 1.8195 1.9723 3.4715 3.6822 3.3127 2.7860 2.2088 1.9987 2.0626 2.5606 2.6525 1.4934 1.4848 1.0736 1.1125 1.2371 1.2806 2.1542 1.5566 1.3269 1.3230 1.2834 1.4302 1.2824 1.3536 1.3813 1.8068 2.0580 1.2622 1.4370 1.4372 1.3899 1.6059 1.2713 1.3085 1.8036 1.3450 2.0147 3.3544 1.9010 1.0840 1.0822 1.0836 1.1141 1.0953 1.1001 1.0894 1.0984 1.1382 1.1373 1.5109 1.0483 1.6322 6.7547 3.2863 1.0717 1.0704 1.0694 1.0665 1.0661 1.0639 1.0648 1.0668 1.0406 1.0668 1.0667 1.0665 1.0915 1.1014 1.0979 1.0894 1.0895 1.0950 1.0947 1.0957 1.0973 1.0957 1.0972 1.0930 1.0910 1.0652
irintensity: 0.5654 0.3435 0.0487 0.0835 0.1971 0.6620 1.2806 3.9769 0.2987 4.9379 7.5343 11.4887 0.6789 5.4981 1.8307 0.6808 2.4690 11.4175 9.1089 20.4698 8.2396 18.0013 64.4194 15.2567 5.4471 0.3014 9.2274 7.8791 28.0901 1.1393 2.4798 7.5059 2.5916 4.6626 8.6626 5.6463 11.3869 3.4634 22.2876 2.8078 10.2209 13.3300 10.5805 27.6650 38.5588 9.6599 0.9339 11.4676 29.8001 12.7650 23.9365 7.8396 30.6423 10.8591 4.5877 14.4506 13.7300 8.0437 11.4062 0.4632 33.1060 24.0436 60.7719 58.9263 21.6126 118.1651 0.6464 41.9387 51.0201 66.0615 3.3225 23.6754 109.5539 1.9571 7.8295 12.3640 9.1366 13.2936 59.8835 15.1555 8.7331 4.1600 51.3197 4.5397 6.4844 34.5042 19.7501 18.2817 10.4854 9.1745 5.2758 2.0502 7.0903 2.1947 1.8393 13.8600 11.4236 25.2067 58.9437 76.5097 1.3185 2.5607 5.1754 2.0957 15.8456 16.2997 6.0002 6.7364 12.4083 31.6136 65.6341 15.3506 35.1955 62.6069 140.3428 1572.8178 55.3053 109.7916 55.4045 18.2798 37.2942 41.9715 33.0239 45.3809 101.9313 46.4260 78.1361 23.4259 19.9274 25.8308 48.9842 30.4169 32.5689 18.3034 44.2464 40.8303 34.2839 24.9296 1.0969 3.9265 30.6049
temp: 298.150 k
press: 1.00000 atm
elementType: 8 8 8 8 7 7 6 6 6 6 6 6 6 6 6 6 6 6 6 6 6 6 6 1 1 1 1 1 1 1 1 1 1 1 1 1 1 1 1 1 1 1 1 1 1 1 1 1 1
symmnumber: 1
zpe: 1084930.8 jmol-1
zpe.correction: 0.413228 hartree
zpe.thermalcorrener: 0.435414 hartree
zpe.thermalcorrenthalpy: 0.436358 hartree
zpe.thermalcorrgfe: 0.361243 hartree
zpe.sumelectzpe: -1071.976469 hartree
zpe.sumelectthermal: -1071.954284 hartree
zpe.sumelectthermalent: -1071.953340 hartree
zpe.sumelectthermalfe: -1072.028454 hartree
dipole: -1.9336 0.1368 -1.3169
dipole: 2.3435
quadrupole: -151.8704 -139.3798 -131.8065
quadrupole: 7.9809 0.9053 9.2166
quadrupole: -10.8515 1.6391 9.2124 7.9809 0.9053 9.2166
hfenergy: -1072.3896976 hartree
pointgroup: C01 [X(C17H26N2O4)]
dipole: 0.7642269 0.1048286 0.5050263 debye
polarizability: 261.4408905|-4.94151|213.6465798|-1.6131986|-18.2504163|164.5043535 unknown
InChI: InChI=1S/C17H26N2O4/c1-13-16(20)14(11-18-2-6-22-7-3-18)10-15(17(13)21)12-19-4-8-23-9-5-19/h10,20-21H,2-9,11-12H2,1H3
charge 0 multiplicity 1
49 atoms
O  -5.00431 -2.731693 -0.482822
O  5.267645 -2.05068 -0.825808
O  2.707958 1.783139 0.013154
O  -1.86761 3.330798 -0.712919
N  -3.402833 -0.448583 0.335389
N  3.06054 -0.722232 0.518594
C  -2.993615 0.978652 0.395952
C  1.784583 -0.615349 1.312474
C  -1.486517 1.16539 0.274647
C  0.818302 0.380118 0.688642
C  -3.305537 -1.005729 -1.039007
C  -4.766098 -0.668135 0.880881
C  2.865009 -1.431591 -0.785188
C  4.171245 -1.351546 1.291734
C  -0.577622 0.191923 0.744562
C  -3.652751 -2.502067 -1.024004
C  -5.094805 -2.169831 0.875529
C  4.176287 -1.414924 -1.585167
C  5.459206 -1.345635 0.450773
C  1.329773 1.584504 0.111524
C  -0.943027 2.357617 -0.268344
C  0.453643 2.589754 -0.372605
C  1.002466 3.867991 -0.976236
H  -3.333952 1.374796 1.374883
H  -3.504088 1.594845 -0.380557
H  2.08681 -0.267849 2.322105
H  1.303128 -1.610143 1.43389
H  -2.273876 -0.862666 -1.409849
H  -3.999252 -0.474303 -1.738666
H  -5.543279 -0.125208 0.285132
H  -4.804417 -0.286594 1.919335
H  2.064648 -0.917151 -1.346817
H  2.549066 -2.483366 -0.604355
H  3.90969 -2.398157 1.567887
H  4.328373 -0.774306 2.22209
H  -1.002045 -0.727583 1.165941
H  -3.670958 -2.919584 -2.044386
H  -2.906562 -3.05058 -0.408405
H  -4.390493 -2.705594 1.548785
H  -6.132415 -2.352884 1.201012
H  4.080053 -2.002138 -2.512419
H  4.451417 -0.36796 -1.837909
H  5.77666 -0.297366 0.259162
H  6.269085 -1.884256 0.968991
H  2.102159 3.817416 -0.99222
H  0.661723 4.022656 -2.020855
H  0.721883 4.764785 -0.386822
H  3.138102 0.834776 0.213499
H  -1.387994 4.105622 -1.099305
