program: Gaussian 09
title: 000268751
version: EM64L-G09RevD.01
frameworkgroup: C1[X(C17H14O5)]
method: RPBEPBE
basis: SDD
operation: Freq
keyword: #pfreq=noraman
keyword: PBEPBE/SDD
title: #p freq=noraman PBEPBE/SDD
converged: YES YES NO NO
title: Mulliken charges:
elementType: O O O O O C C C C C C C C C C C C C C C C C H H H H H H H H H H H H H H
charge: -0.260978 -0.260986 -0.220953 -0.220970 -0.256168 0.341133 0.341075 0.339672 0.339662 -0.435069 -0.435074 -0.373980 -0.373957 -0.386591 -0.386595 -0.193216 -0.193216 0.125205 0.125222 -0.788608 -0.788595 0.248135 0.311174 0.311198 0.284459 0.284464 0.270861 0.270848 0.241624 0.241624 0.243216 0.243076 0.263012 0.243183 0.243102 0.263011
chargesum: 0.00000
title: Mulliken charges with hydrogens summed into heavy atoms:
elementType: O O O O O C C C C C C C C C C C C C C C C C
charge: -0.260978 -0.260986 -0.220953 -0.220970 -0.256168 0.341133 0.341075 0.339672 0.339662 -0.123895 -0.123876 -0.089522 -0.089493 -0.115730 -0.115747 0.048408 0.048408 0.125205 0.125222 -0.039304 -0.039299 0.248135
polarizability: 3.09614191e+02 2.00804899e-03 2.34957474e+02 -1.94670402e-01 -5.14456975e-03 8.63905906e+01
1716.lowfreq: -0.0009 -0.0005 -0.0004 2.4014 3.9311 10.8076 13.3668 27.9968 41.0495
frequency: 13.3667 27.9863 41.0495 41.2831 49.7376 62.2695 90.2154 107.7781 149.2363 152.5621 169.2964 169.4922 172.0427 214.3191 241.4047 254.5833 255.0393 340.7599 349.6032 360.3458 361.1847 423.1750 423.9430 442.4232 476.4221 491.9470 494.8244 506.4752 580.1099 580.9007 623.9758 625.6488 628.1013 663.4415 665.0665 696.0640 697.2014 716.0807 718.5669 818.0004 819.0621 846.2830 852.1378 921.5827 924.4410 941.6876 942.0585 947.4900 949.1153 982.5461 986.7251 991.1496 1003.1095 1003.1697 1028.1576 1028.2762 1077.8425 1079.2247 1092.4817 1092.6604 1140.4211 1151.3616 1168.1275 1171.1588 1185.6271 1266.9628 1275.4839 1301.0161 1301.4217 1372.4422 1373.6544 1391.0663 1391.3076 1420.8552 1423.6435 1448.8405 1449.8337 1463.3934 1463.5272 1472.1936 1472.8471 1580.4393 1580.8557 1594.6983 1596.2621 1616.3330 1616.5955 1628.4658 2987.5609 2987.5955 3071.1707 3071.1928 3127.6897 3127.7570 3148.0788 3148.1165 3166.8668 3166.8798 3179.2316 3179.2789 3207.7068 3208.0624
redmass: 4.2276 6.4496 10.4055 6.3963 5.3778 5.1401 5.6652 5.3074 4.2751 4.6752 1.0545 1.0584 5.5490 6.7274 4.9011 5.4101 5.6829 7.9109 6.7621 5.1458 4.0617 3.1945 3.2218 5.3646 4.4386 3.6813 3.6401 6.1674 4.5218 4.7360 3.1393 3.1554 7.6139 7.5560 12.1578 2.1685 2.1793 8.3345 7.0324 1.4447 1.4464 9.1704 6.4929 1.3821 1.3761 1.3648 1.3670 2.2913 2.0725 5.5644 6.1641 5.2160 1.3609 1.3607 1.8309 1.8306 1.8771 1.7888 1.5761 1.5572 2.9829 7.8196 1.2100 1.1005 2.4102 3.8614 4.7161 1.3336 1.3347 1.2478 1.2526 10.3126 10.2689 2.9830 3.0736 1.1055 1.1021 1.0489 1.0488 2.4695 2.4156 6.7917 6.7639 6.3090 6.1278 8.0217 7.9075 11.0405 1.0377 1.0377 1.0966 1.0966 1.0994 1.0994 1.0875 1.0875 1.0929 1.0929 1.0988 1.0988 1.0918 1.0917
irintensity: 0.0001 0.8881 2.6097 0.3864 0.0000 12.0853 0.0000 0.5671 0.0711 0.0008 0.4614 0.6592 6.7791 4.2088 0.0040 1.6668 0.0111 9.2297 4.2868 14.0315 0.0457 0.0002 1.1600 4.8040 0.0522 0.0001 6.0067 5.1071 35.2464 3.7087 0.0003 0.0023 0.9654 0.4198 15.4391 0.0004 60.4398 3.0049 5.3048 0.0000 105.8359 11.0337 59.8305 0.0016 51.4028 0.0001 0.0688 36.9535 0.0767 1.6410 19.0504 1.3244 0.0153 4.6803 0.0000 0.9941 3.8189 7.4469 9.7139 12.5523 316.4738 2172.9823 23.2600 0.2516 37.6381 59.6423 362.3699 4.5578 7.1871 32.5560 66.4557 55.2148 3.8576 103.2230 10.0314 55.9885 21.8799 0.0084 42.1332 1.9722 45.8888 291.4111 23.2459 15.8412 7.1695 18.5696 65.1019 149.3686 5.3721 0.2526 3.7228 16.6738 7.4260 24.2114 10.4768 5.0956 2.6113 3.1864 1.5632 12.5821 9.5146 1.5396
temp: 298.150 k
press: 1.00000 atm
elementType: 8 8 8 8 8 6 6 6 6 6 6 6 6 6 6 6 6 6 6 6 6 6 1 1 1 1 1 1 1 1 1 1 1 1 1 1
symmnumber: 1
zpe: 702812.9 jmol-1
zpe.correction: 0.267687 hartree
zpe.thermalcorrener: 0.288087 hartree
zpe.thermalcorrenthalpy: 0.289031 hartree
zpe.thermalcorrgfe: 0.215375 hartree
zpe.sumelectzpe: -1030.767977 hartree
zpe.sumelectthermal: -1030.747577 hartree
zpe.sumelectthermalent: -1030.746633 hartree
zpe.sumelectthermalfe: -1030.820289 hartree
dipole: 0.0005 -2.6825 0.0010
dipole: 2.6825
quadrupole: -164.1222 -116.3659 -129.1935
quadrupole: -0.0006 0.1391 -0.0040
quadrupole: -27.5617 20.1946 7.3671 -0.0006 0.1391 -0.0040
hfenergy: -1031.035664 hartree
pointgroup: C01 [X(C17H14O5)]
dipole: 0.0048185 0.0033172 1.0553478 debye
polarizability: 306.809667|24.8553107|89.1944938|-0.422906|0.3907754|234.9580949 unknown
InChI: InChI=1S/C17H14O5/c1-11(18)13-5-3-7-15(9-13)21-17(20)22-16-8-4-6-14(10-16)12(2)19/h3-10H,1-2H3
charge 0 multiplicity 1
36 atoms
O  -1.078601 -0.120472 1.827227
O  1.093024 0.1337 1.816257
O  -6.012161 -0.68364 -1.849762
O  5.991695 0.669499 -1.911011
O  -0.002473 -0.001426 -0.275965
C  -4.245711 -0.483276 -0.224841
C  4.240647 0.480464 -0.268203
C  -2.434191 -0.275079 1.384007
C  2.444466 0.284381 1.359237
C  -2.858684 -0.326794 0.040806
C  2.856152 0.326559 0.011734
C  -5.171923 -0.584036 0.845712
C  5.177081 0.588055 0.792753
C  -3.344706 -0.374689 2.457676
C  3.36523 0.390937 2.423468
C  -4.719514 -0.529778 2.179558
C  4.737419 0.543253 2.131185
C  -4.772318 -0.547106 -1.637882
C  4.753891 0.534541 -1.686556
C  -3.788626 -0.445956 -2.797192
C  3.759466 0.425428 -2.835924
C  0.003282 0.00334 0.972358
H  -2.132714 -0.247344 -0.768383
H  2.122467 0.241747 -0.7899
H  -6.232162 -0.703663 0.601895
H  6.235003 0.70549 0.538051
H  -2.964144 -0.329163 3.48206
H  2.994428 0.352743 3.451728
H  -5.430951 -0.607525 3.007764
H  5.456757 0.62628 2.952021
H  -3.042452 -1.261342 -2.757715
H  -3.232158 0.509341 -2.765917
H  -4.343037 -0.509754 -3.745319
H  3.012933 1.240395 -2.794724
H  3.204216 -0.530147 -2.793447
H  4.304973 0.483638 -3.78956
