program: Gaussian 09
title: 000268701
version: EM64L-G09RevD.01
frameworkgroup: C1[X(C10H8Cl2N2O2)]
method: RPBEPBE
basis: SDD
operation: Freq
keyword: #p
keyword: freq=noraman
keyword: PBEPBE/SDD
title: #p freq=noraman PBEPBE/SDD
converged: NO YES NO NO
title: Mulliken charges:
elementType: Cl Cl O O N N C C C C C C C C C C H H H H H H H H
charge: 0.004415 0.004422 -0.205289 -0.205290 -0.194179 -0.194170 0.314207 0.314206 0.091196 0.091187 -0.269577 -0.269575 -0.655628 -0.655640 -0.151877 -0.151924 0.282831 0.282838 0.293385 0.245268 0.245268 0.245278 0.245264 0.293386
chargesum: 0.00000
title: Mulliken charges with hydrogens summed into heavy atoms:
elementType: Cl Cl O O N N C C C C C C C C C C
charge: 0.004415 0.004422 -0.205289 -0.205290 -0.194179 -0.194170 0.314207 0.314206 0.091196 0.091187 0.013253 0.013263 0.128292 0.128287 -0.151877 -0.151924
polarizability: 2.53023039e+02 -6.20610255e-04 1.59386873e+02 1.48080234e-02 -4.32855858e-03 6.38654732e+01
1716.lowfreq: -8.9193 -6.1867 -2.1068 -0.0032 -0.0020 0.0003 49.2436 59.8807 88.6935
frequency: 49.1913 59.8464 88.6934 109.3701 166.2004 179.1552 185.1623 215.7751 238.6719 240.8203 288.8295 293.6251 329.0470 345.7475 381.2286 394.0538 394.2304 434.4016 463.9355 466.3162 486.5932 528.1359 606.9790 617.3610 631.2274 676.2502 698.5301 726.9706 757.6457 846.6133 860.7257 891.9683 901.8034 1006.0834 1035.9180 1072.9774 1119.2410 1119.4751 1136.6107 1152.6085 1238.4728 1258.9881 1285.4668 1300.3897 1336.3113 1394.5548 1396.2604 1423.4174 1427.0843 1480.5681 1482.2643 1495.5397 1496.3121 1496.4420 1573.5765 1585.7870 1612.2301 1616.0174 2993.5143 2993.9099 3081.8593 3081.9045 3132.0304 3132.1083 3191.4421 3193.3061
redmass: 10.4306 5.9681 7.4785 4.4078 8.2463 28.3435 2.3628 2.1166 1.6013 1.3087 6.3314 9.8580 4.9607 5.8769 3.9770 5.7963 6.3319 6.2900 7.9434 3.7333 10.8528 7.4608 8.6813 9.2170 4.8208 7.3931 3.5962 6.7016 11.7940 1.5339 1.4091 7.7084 2.7878 6.1377 7.3199 2.2279 1.3133 1.3192 2.1367 1.8619 2.4900 1.9105 5.2282 3.7728 3.5136 8.9723 3.1469 1.2509 1.4060 1.0972 1.1261 3.6017 1.0443 1.0448 9.4061 9.0839 11.0042 8.3566 1.0350 1.0351 1.1028 1.1028 1.0987 1.0987 1.0909 1.0917
irintensity: 0.0000 9.8926 0.0000 0.6238 2.0831 0.0392 0.0000 0.1146 0.8725 0.0001 2.5021 1.6101 0.0000 0.0193 7.9784 1.0593 2.0947 10.0913 0.1760 11.3086 2.9437 14.0078 27.7733 0.0000 18.3172 6.2405 0.0000 5.6478 0.0000 0.0000 50.3326 23.4909 20.8822 13.3932 8.4161 6.8145 0.0000 0.0295 45.2009 43.3921 35.3987 1.0546 145.2352 24.2533 3.8712 17.9486 1.7059 2.9209 107.2202 67.0192 53.2839 207.3049 0.0157 43.6438 91.0176 50.5512 663.1725 3.1557 46.0723 6.6289 0.1140 37.6160 2.2245 0.0257 0.0194 0.5838
temp: 298.150 k
press: 1.00000 atm
elementType: 17 17 8 8 7 7 6 6 6 6 6 6 6 6 6 6 1 1 1 1 1 1 1 1
symmnumber: 1
zpe: 436025.5 jmol-1
zpe.correction: 0.166073 hartree
zpe.thermalcorrener: 0.180582 hartree
zpe.thermalcorrenthalpy: 0.181526 hartree
zpe.thermalcorrgfe: 0.124173 hartree
zpe.sumelectzpe: -1564.807659 hartree
zpe.sumelectthermal: -1564.793150 hartree
zpe.sumelectthermalent: -1564.792206 hartree
zpe.sumelectthermalfe: -1564.849560 hartree
dipole: -3.3121 0.0001 0.0013
dipole: 3.3121
quadrupole: -148.3746 -89.8363 -106.2247
quadrupole: 0.0011 0.0016 -0.0028
quadrupole: -33.5628 24.9755 8.5872 0.0011 0.0016 -0.0028
hfenergy: -1564.9737322 hartree
pointgroup: C01 [X(C10H8Cl2N2O2)]
dipole: 1.303087 -0.0021103 -0.0005158 debye
dipolederiv: -0.6105942 -0.2778124 -0.0000884 -0.3877694 -0.2496031 -0.0000609 -0.0000875 -0.0000439 -0.0205508 -0.6084199 0.2789835 -0.0000606 0.3889346 -0.2517682 0.0000383 -0.0000481 0.0000273 -0.0205434 -1.2835895 0.1979219 -0.0000013 0.5748114 -0.5718722 -0.0000049 -0.0001442 0.0000508 -0.3293448 -1.2860743 -0.1956055 0.0000261 -0.5725068 -0.5693754 0.000019 0.0002512 0.0000133 -0.3293476 -1.1928159 0.3582666 -0.0001095 -0.1989126 -0.5243926 -0.0000072 -0.0000034 0.0000305 -0.1635612 -1.1933268 -0.3560787 -0.0000095 0.2010898 -0.5238743 -0.0000633 0.0002014 -0.0001337 -0.1635528 0.605583 -0.505712 0.000086 -0.5607066 0.086384 -0.0000541 -0.0000073 -0.0000191 0.0670828 0.6090014 0.5040118 0.0001854 0.5590016 0.0829122 0.0000389 0.0000639 0.0000583 0.0670734 1.7977434 -0.2066032 0.0000401 -0.320646 0.4594387 0.0000269 0.0001442 -0.0000245 0.2090462 1.7994312 0.2022589 -0.0002182 0.3163281 0.457764 -0.0000271 -0.0004783 -0.0000829 0.2090444 -0.1318511 0.0470919 -0.0000072 -0.1095614 -0.0639815 -0.0000149 0.0000028 0.0000002 -0.1267824 -0.1316451 -0.0468714 -0.0000137 0.1098002 -0.0642021 0.000015 -0.0000334 -0.0000254 -0.1267791 -0.0244102 -0.0091054 -0.0000147 0.0084472 0.3753256 0.000006 -0.0000388 0.0000322 0.2125869 -0.0243844 0.0103732 -0.0000138 -0.0071753 0.3753029 0.0000163 -0.0000775 0.0000108 0.2125778 0.5787989 0.5117681 0.0001126 0.8502367 0.3046514 0.0001112 0.0001098 0.0000854 -0.0629758 0.5743707 -0.5126422 0.0000678 -0.8511191 0.3091067 -0.0000733 0.0000448 -0.0000501 -0.0629804 0.107548 0.013181 -0.0000063 0.0067968 -0.0046193 -0.0000128 0.0000025 -0.0000178 0.163668 0.1074923 -0.0135517 -0.0000049 -0.0071587 -0.0045443 -0.0000027 -0.0000073 -0.0000001 0.1636664 0.0155482 0.1361418 -0.0000496 -0.0348951 0.1569488 -0.0000062 -0.0000197 0.0000007 0.1359521 0.0688749 -0.0997999 0.1024198 -0.0210597 0.0159963 0.0094734 0.0758765 0.0522572 -0.0425217 0.0689345 -0.0997924 -0.1023603 -0.0210641 0.0159559 -0.0095 -0.0758313 -0.0523268 -0.0425986 0.0693344 0.0996194 -0.1022844 0.0209042 0.0155349 0.0098469 -0.0756378 0.0525912 -0.042617 0.0692334 0.0996355 0.102437 0.0208772 0.0156477 -0.0097805 0.0757409 -0.0524604 -0.042497 0.0152173 -0.135679 -0.000132 0.0353472 0.1572638 0.000016 -0.0000235 0.0000269 0.1359546 unknown
polarizability: 253.0227908|-0.1524607|159.3871209|0.0148151|0.0043043|63.8654732 unknown
InChI: InChI=1S/C10H8Cl2N2O2/c1-13-7-3-5(11)6(12)4-8(7)14(2)10(16)9(13)15/h3-4H,1-2H3
charge 0 multiplicity 1
24 atoms
Cl 4.106507 1.644283 0.000278
Cl 4.101137 -1.658046 0.000105
O  -3.453534 1.407875 -0.000509
O  -3.458065 -1.397061 -0.000151
N  -1.112866 1.41737 -0.00046
N  -1.117442 -1.414095 -0.000743
C  0.111591 0.715548 -0.000332
C  0.109271 -0.716246 -0.00044
C  -2.369069 0.769082 -0.00038
C  -2.371541 -0.761773 -0.000493
C  1.347594 1.403983 -0.000092
C  1.343006 -1.40874 -0.000275
C  -1.114142 2.896827 -0.000575
C  -1.123453 -2.893549 -0.001138
C  2.564712 0.700186 0.000025
C  2.562424 -0.708943 -0.000058
H  1.377492 2.494769 0.000008
H  1.369277 -2.499614 -0.000283
H  -2.16349 3.224503 -0.000817
H  -0.609587 3.285287 -0.90268
H  -0.609999 3.28545 0.901695
H  -0.620747 -3.283993 0.901152
H  -0.619941 -3.28342 -0.903213
H  -2.173841 -3.21788 -0.001622
