program: Gaussian 09
title: 000268678
version: EM64L-G09RevD.01
frameworkgroup: C1[X(C7H11NO3S)]
method: RPBEPBE
basis: SDD
operation: Freq
keyword: #p
keyword: freq=noraman
keyword: PBEPBE/SDD
title: #p freq=noraman PBEPBE/SDD
converged: YES YES NO NO
title: Mulliken charges:
elementType: S O O O N C C C C C C C H H H H H H H H H H H
charge: 0.120178 -0.412662 -0.229484 -0.238692 -0.330572 -0.655048 -0.426146 -0.434701 0.001607 0.195075 -0.043405 -0.559368 0.279559 0.300953 0.300285 0.260778 0.227127 0.260707 0.321484 0.241909 0.224360 0.218677 0.377379
chargesum: 0.00000
title: Mulliken charges with hydrogens summed into heavy atoms:
elementType: S O O O N C C C C C C C
charge: 0.120178 -0.035283 -0.229484 -0.238692 -0.009088 -0.074536 0.134917 0.053133 0.001607 0.195075 0.198504 -0.116331
polarizability: 1.73100605e+02 3.57890134e+00 8.93802831e+01 1.21487408e+01 1.77737568e+00 7.92236533e+01
1716.lowfreq: -18.1217 -6.7151 -5.4006 -0.0023 0.0007 0.0010 13.3005 28.7591 33.3415
frequency: 10.4658 28.5143 33.3183 56.6671 71.1078 76.9852 98.0080 151.6375 171.5946 215.7857 273.2867 317.4077 348.8611 421.0623 431.9788 460.4237 502.7153 567.4206 575.0591 625.5646 637.4228 650.7980 706.8286 748.3616 764.2112 866.5212 900.3270 957.3759 981.5659 992.2243 1007.3373 1027.0420 1033.3096 1090.7246 1142.5275 1159.4748 1173.1172 1232.1961 1242.4909 1268.0476 1282.5384 1282.7959 1333.7694 1357.2321 1427.4201 1428.1379 1438.5842 1466.7562 1476.8183 1647.9408 1657.9938 1663.2918 2991.4001 3012.6004 3054.6222 3057.6845 3068.9520 3089.3372 3111.7048 3132.6119 3201.1486 3511.4328 3541.7446
redmass: 4.1139 9.5867 6.1562 5.3065 3.7671 2.2039 2.6207 6.9423 2.8728 5.4338 5.1055 4.5414 2.7829 4.7489 6.9296 2.3245 1.7588 5.0138 1.3795 4.2965 1.3173 1.7099 6.4050 1.3914 4.4303 4.2758 1.5352 1.3228 2.1563 1.7902 1.2783 3.3941 3.3358 2.4659 2.0067 1.1568 2.7484 1.2800 1.1939 1.3327 1.2387 1.2422 1.2509 1.9147 1.1331 1.1486 1.0900 1.1317 1.5156 8.4282 4.6588 8.1583 1.0614 1.0614 1.0583 1.0999 1.0988 1.0604 1.0951 1.1069 1.1142 1.0639 1.0779
irintensity: 1.0659 0.8009 0.1374 6.2067 0.3731 1.4072 0.8350 5.0063 1.8588 0.0381 25.1112 2.8311 4.0897 28.3463 10.3936 3.7743 33.7411 54.9381 115.0673 2.0977 126.4559 24.3630 31.6602 15.7605 34.3373 1.5437 24.8806 87.6635 26.7098 4.2469 28.1214 1.9707 213.2042 66.4283 8.8857 4.6714 283.3479 5.2848 55.4263 3.9297 1.4084 10.2433 6.1377 105.8895 28.5257 3.6448 46.5514 64.6357 221.3541 218.6207 28.6535 207.2204 40.6125 12.9416 6.7097 5.4409 1.0364 10.7016 9.2897 1.1245 23.1777 20.8899 35.9961
temp: 298.150 k
press: 1.00000 atm
elementType: 16 8 8 8 7 6 6 6 6 6 6 6 1 1 1 1 1 1 1 1 1 1 1
symmnumber: 1
zpe: 462095.2 jmol-1
zpe.correction: 0.176003 hartree
zpe.thermalcorrener: 0.190296 hartree
zpe.thermalcorrenthalpy: 0.191241 hartree
zpe.thermalcorrgfe: 0.130441 hartree
zpe.sumelectzpe: -950.894882 hartree
zpe.sumelectthermal: -950.880588 hartree
zpe.sumelectthermalent: -950.879644 hartree
zpe.sumelectthermalfe: -950.940444 hartree
dipole: -2.6827 0.1568 -2.0882
dipole: 3.4032
quadrupole: -62.4961 -80.5858 -81.5210
quadrupole: -4.5671 -2.7034 0.4332
quadrupole: 12.3715 -5.7181 -6.6534 -4.5671 -2.7034 0.4332
hfenergy: -951.0708847 hartree
pointgroup: C01 [X(C7H11N1O3S1)]
dipole: -1.0791311 0.7817566 -0.130662 debye
dipolederiv: -0.6826996 -0.1012663 -0.1427769 -0.2426829 -0.2035899 -0.1617943 -0.4495286 -0.0919618 -0.4175265 -0.662754 -0.255477 0.3997733 -0.2330821 -0.4801174 0.2146279 0.4513102 0.2456528 -0.9667466 -0.8411554 0.1159427 0.0314812 0.1205978 -0.6373211 -0.3860635 0.0096472 -0.3906501 -0.7484627 -0.7303367 0.2573447 -0.1167176 0.1187605 -0.6171363 0.3309026 0.1342145 0.2287349 -0.6593254 -1.7377398 0.0332672 -0.1999699 0.0054617 -0.3962879 0.1015809 -0.217144 0.0822306 -0.407302 0.4980089 -0.0339702 -0.0542091 -0.1121347 0.0569157 -0.0207804 -0.0874137 -0.0242902 0.0918894 -0.3933716 0.1357558 0.0742826 0.359155 -0.0346539 0.0326432 -0.0776003 0.0790954 -0.0078276 0.4720951 0.0441752 0.1631971 0.3568954 0.2390216 0.0108527 0.4512493 -0.0109094 0.3479016 2.1356098 -0.1333787 0.3582594 -0.1779412 0.6419053 0.5301233 0.5299644 0.5464595 0.9401342 1.2642735 -0.226673 -0.3018199 -0.2075079 0.7487961 -0.5781134 -0.4688132 -0.5448009 1.1690637 0.1683616 -0.0347027 -0.0710045 -0.027835 0.0090318 -0.1790381 -0.2226214 -0.1530123 -0.122414 -0.218087 -0.0128473 -0.0591467 -0.0159386 -0.1121674 -0.2455904 -0.0177126 -0.243812 -0.1663082 -0.0103047 0.004119 -0.0715191 -0.0066913 0.1104794 -0.0044143 -0.0117124 -0.0012348 -0.0147906 0.0200249 -0.0065484 0.013051 -0.0023547 -0.0308016 0.0149913 0.0856329 -0.0454118 0.0807323 0.1346885 0.0046636 -0.0622833 0.0059142 0.1097517 -0.0262411 -0.022622 -0.008943 0.0028689 0.088034 -0.0167047 0.0263685 -0.0609139 -0.0452232 0.0077658 0.0268623 -0.0318772 0.0890274 -0.0609311 0.0388989 -0.0968845 -0.0122746 -0.0457687 0.1263878 -0.1171781 0.0809636 -0.0146008 0.0810331 0.0653803 0.091193 -0.0509619 0.0423564 -0.0681311 0.0007289 -0.0308402 0.073149 0.2200247 0.0028472 -0.0528916 0.0112842 0.2534938 -0.0996839 -0.0936669 -0.110705 0.1711245 0.0587977 0.0458456 -0.0110325 0.025997 0.001671 0.128259 0.0523939 0.1314107 0.0477756 -0.0558461 -0.0548312 0.0684168 -0.0427003 0.0933294 0.0947536 0.0995718 0.0891351 0.1082212 0.0964483 0.0096291 0.0103176 0.0385542 0.0098564 0.1441372 -0.0214986 0.1523283 0.0626844 0.1558261 0.1185302 0.0039151 0.1503991 0.2864587 0.0328251 -0.0340639 0.0524378 0.3407319 unknown
polarizability: 173.705009|-8.1970833|78.418588|6.0090513|0.9767768|89.580944 unknown
InChI: InChI=1S/C7H11NO3S/c1-2-4-8-7(11)12-5-3-6(9)10/h2,8-9H,1,3-5H2
charge 0 multiplicity 1
23 atoms
S  0.207041 0.801763 1.656368
O  4.524074 0.591889 -1.308219
O  -0.346911 -0.802114 -0.540172
O  4.511308 -0.8223 0.534039
N  -2.130689 0.443395 0.325771
C  1.841964 -0.047574 1.253458
C  2.540588 0.604215 0.05208
C  -3.149716 -0.03101 -0.637529
C  -0.823935 0.015338 0.288899
C  3.926095 0.029688 -0.170439
C  -4.352804 -0.621344 0.070007
C  -5.625536 -0.185184 -0.101023
H  2.441451 0.023413 2.174519
H  1.61371 -1.105149 1.051307
H  1.943257 0.451631 -0.864782
H  2.639414 1.697818 0.186985
H  -3.461395 0.799913 -1.299463
H  -2.646993 -0.791188 -1.263114
H  -2.42373 1.096559 1.05569
H  -4.140353 -1.459023 0.749561
H  -6.468136 -0.656469 0.41625
H  -5.861907 0.650119 -0.772659
H  5.430803 0.197915 -1.428934
