program: Gaussian 09
title: 000268674
version: EM64L-G09RevD.01
frameworkgroup: C1[X(C12H12O3)]
method: RPBEPBE
basis: SDD
operation: Freq
keyword: #pfreq=noraman
keyword: PBEPBE/SDD
title: #p freq=noraman PBEPBE/SDD
converged: YES YES NO NO
title: Mulliken charges:
elementType: O O O C C C C C C C C C C C C H H H H H H H H H H H H
charge: -0.219594 -0.109176 -0.163902 0.300266 -0.383879 0.511373 -0.692739 -0.716600 -0.012322 0.127069 -0.421746 -0.366031 -0.230893 -0.248973 -0.236875 0.278522 0.246256 0.238136 0.222797 0.242865 0.230489 0.233285 0.231089 0.244006 0.230237 0.231876 0.234462
chargesum: 0.00000
title: Mulliken charges with hydrogens summed into heavy atoms:
elementType: O O O C C C C C C C C C C C C
charge: -0.219594 -0.109176 -0.163902 0.300266 -0.105356 0.511373 0.014451 -0.009962 -0.012322 0.127069 -0.190657 -0.122025 -0.000656 -0.017096 -0.002413
polarizability: 1.70758871e+02 -7.00030950e+00 1.23881819e+02 -2.97777724e+00 -1.40678604e+01 9.74631632e+01
1716.lowfreq: -9.6336 0.0005 0.0009 0.0010 3.5132 5.6809 40.4834 54.5559 81.4857
frequency: 40.2572 54.5194 81.4854 106.2540 142.9996 198.5600 227.5444 241.5006 251.6271 279.2613 306.9702 330.0979 350.0633 380.9787 404.2832 418.1314 482.8772 543.0440 568.8523 605.9393 616.2727 625.4500 658.5349 704.9327 755.9770 787.8461 826.9109 846.2531 852.8084 867.3660 920.4402 935.8691 967.8254 977.5072 991.6766 996.0621 1000.8062 1003.9040 1029.5791 1085.0438 1091.6815 1140.3079 1150.3916 1175.3291 1192.9320 1197.2636 1239.5235 1286.4485 1294.9700 1336.5577 1381.5169 1384.6644 1399.5611 1441.1600 1453.7919 1461.6447 1471.9765 1481.7139 1487.9498 1592.3482 1614.8571 1676.8411 1687.7035 2943.6145 2992.7299 2995.8232 3090.3676 3094.3244 3100.2554 3107.2876 3115.0454 3131.7700 3143.6822 3155.8657 3169.1316
redmass: 4.0713 6.3562 4.7164 5.3785 4.6940 1.0819 2.4836 2.6005 1.3630 4.2437 5.4444 3.8743 4.9054 5.3678 2.8120 3.7011 3.9628 3.9330 5.6582 6.1590 5.4034 5.8432 6.4851 1.7429 2.0037 7.5993 3.5736 7.9553 1.2484 3.8182 1.4294 1.4574 2.6924 1.4025 4.6232 1.7656 1.4757 1.7589 2.2329 1.8580 3.1912 1.6812 2.2748 1.0602 1.4006 1.2415 2.9680 2.5379 2.4987 1.3128 7.7391 1.2589 1.2060 2.1427 1.0624 1.0498 1.0592 1.0754 2.1987 5.9900 6.0365 12.8682 13.0079 1.0798 1.0358 1.0367 1.0994 1.0995 1.1003 1.0998 1.0883 1.0863 1.0916 1.0956 1.1012
irintensity: 0.7021 0.3582 0.6892 0.3545 2.1095 0.1891 0.2295 3.8303 0.2042 0.5500 5.0905 1.8675 4.0230 7.1021 0.0307 1.3550 15.8636 4.9704 1.6288 4.2992 5.2213 4.1166 4.4850 50.1651 43.1763 47.0232 8.6900 29.1923 0.0602 0.9040 1.8508 1.5566 29.4647 0.0525 1.1304 3.2061 0.6937 19.1989 5.0123 52.1012 116.5892 13.6513 33.3937 0.4182 7.5959 0.5878 61.8870 48.8688 8.7894 3.5206 0.3139 38.9018 18.0321 8.5520 0.3279 4.6385 12.4166 21.3819 14.2009 1.6106 4.0140 83.5161 302.3694 12.7186 13.1766 3.7401 15.2653 15.5686 16.7727 28.3365 9.0688 0.1772 18.0317 28.8045 12.7942
temp: 298.150 k
press: 1.00000 atm
elementType: 8 8 8 6 6 6 6 6 6 6 6 6 6 6 6 1 1 1 1 1 1 1 1 1 1 1 1
symmnumber: 1
zpe: 551163.5 jmol-1
zpe.correction: 0.209927 hartree
zpe.thermalcorrener: 0.223547 hartree
zpe.thermalcorrenthalpy: 0.224491 hartree
zpe.thermalcorrgfe: 0.169468 hartree
zpe.sumelectzpe: -689.054616 hartree
zpe.sumelectthermal: -689.040996 hartree
zpe.sumelectthermalent: -689.040052 hartree
zpe.sumelectthermalfe: -689.095075 hartree
dipole: -5.0355 4.2812 0.5676
dipole: 6.6339
quadrupole: -100.3480 -92.5079 -81.9980
quadrupole: 6.5786 -0.0341 -5.8843
quadrupole: -8.7301 -0.8899 9.6200 6.5786 -0.0341 -5.8843
hfenergy: -689.2645431 hartree
pointgroup: C01 [X(C12H12O3)]
dipole: 1.9969533 1.6734402 -0.153805 debye
polarizability: 170.8469655|6.7960465|122.1994265|-3.1291444|15.3329048|99.0574609 unknown
InChI: InChI=1S/C12H12O3/c1-12(2)9(10(13)11(14)15-12)8-6-4-3-5-7-8/h3-7,9H,1-2H3
charge 0 multiplicity 1
27 atoms
O  -2.639389 0.85574 -0.064975
O  -1.054448 -2.310429 0.367535
O  -3.836701 -1.137539 0.139426
C  -1.162942 1.258217 -0.202307
C  -0.411458 0.109238 0.571564
C  1.067637 -0.055436 0.275211
C  -0.853748 1.289247 -1.706072
C  -1.040672 2.63117 0.456524
C  -1.329395 -1.096496 0.350277
C  -2.757966 -0.529059 0.12472
C  2.011562 0.67936 1.03835
C  1.539651 -0.909083 -0.754853
C  3.394101 0.583346 0.767839
C  2.922048 -1.008266 -1.02473
C  3.854056 -0.260252 -0.269139
H  -0.534332 0.35019 1.651862
H  -1.552112 1.977654 -2.21094
H  0.178057 1.639027 -1.880155
H  -0.960253 0.291278 -2.167912
H  -1.656557 3.371404 -0.081906
H  -1.37877 2.598407 1.506691
H  0.010786 2.968481 0.431531
H  1.663771 1.324804 1.855166
H  0.835074 -1.516062 -1.332602
H  4.108827 1.156557 1.368485
H  3.272299 -1.676498 -1.818997
H  4.926175 -0.342201 -0.478693
