program: Gaussian 09
title: 000268664
version: EM64L-G09RevD.01
frameworkgroup: C1[X(C11H16O2)]
method: RPBEPBE
basis: SDD
operation: Freq
keyword: #pfreq=noraman
keyword: PBEPBE/SDD
title: #p freq=noraman PBEPBE/SDD
converged: YES YES NO NO
title: Mulliken charges:
elementType: O O C C C C C C C C C C C H H H H H H H H H H H H H H H H
charge: -0.456739 -0.426752 -0.253167 0.302817 0.389540 -0.395484 -0.768385 -0.736063 -0.447779 -0.367151 -0.226440 -0.249746 -0.240026 0.208148 0.208337 0.219009 0.236957 0.239577 0.223809 0.247053 0.224956 0.212522 0.341142 0.259623 0.231690 0.229936 0.227550 0.333528 0.231537
chargesum: 0.00000
title: Mulliken charges with hydrogens summed into heavy atoms:
elementType: O O C C C C C C C C C C C
charge: -0.115596 -0.093225 -0.045019 0.302817 0.389540 0.031862 -0.068042 -0.051533 -0.188156 -0.135461 0.003496 -0.022196 -0.008488
polarizability: 1.59526694e+02 3.19981687e+00 9.83546467e+01 -3.65438813e+00 1.53250887e+01 1.08176605e+02
1716.lowfreq: -15.9575 -11.6227 -0.0011 -0.0008 -0.0007 6.6972 39.5557 53.5943 84.2540
frequency: 39.0875 53.5082 84.1827 106.2118 159.1499 209.7029 233.2043 247.6248 264.0350 290.7314 298.3978 308.5781 341.2112 369.8249 383.7206 407.3363 419.3005 443.1861 517.7853 537.6268 616.7760 629.5635 697.8061 708.0520 772.1635 825.8739 845.8461 856.3518 911.6489 921.4854 929.5527 959.5080 977.3124 989.7038 996.4796 1000.1677 1016.8390 1028.5420 1046.1793 1081.5103 1098.2278 1141.2982 1166.6643 1174.4286 1194.8528 1201.2736 1216.4583 1261.4108 1296.1563 1328.5169 1337.1065 1346.2904 1374.8690 1381.3253 1384.5890 1392.1645 1438.8706 1455.1936 1466.0160 1470.9393 1481.7090 1484.6429 1488.3318 1587.5657 1609.9861 2962.8483 2969.1601 2983.0332 2991.2075 3076.8250 3081.7786 3085.5383 3089.6846 3115.8755 3122.8206 3127.5553 3140.0344 3148.5385 3164.7027 3519.3191 3559.8444
redmass: 3.4967 3.8941 3.4938 2.8611 2.3279 1.8584 1.8587 1.4168 2.5383 2.6410 2.6446 1.8214 2.1396 1.1869 2.2634 2.5803 3.0656 3.4672 3.0594 2.9390 6.3220 5.5679 3.5085 1.5623 2.0754 3.0651 2.9634 1.3378 1.7860 1.5400 1.4763 3.6180 1.3881 6.1510 1.3109 1.3360 1.8874 2.3445 2.6690 1.5409 1.6256 1.4505 1.8793 1.0928 1.1498 1.9443 2.6274 1.5511 1.2946 1.2850 1.4544 1.5218 1.2600 4.8730 1.2770 1.2164 2.1276 1.0612 1.0549 1.0752 1.9409 1.1326 1.0492 5.8252 6.0328 1.0811 1.0703 1.0357 1.0364 1.0989 1.0972 1.0969 1.0983 1.1002 1.0846 1.0876 1.0921 1.0964 1.1016 1.0653 1.0661
irintensity: 1.9386 0.5743 0.6167 1.4880 4.2535 5.8881 2.5596 2.4126 13.6511 3.0959 1.0806 61.9399 105.0628 120.1586 35.0011 11.0366 9.9478 3.5014 45.4513 7.3416 0.4442 2.5217 4.5463 58.1134 29.7666 5.5926 11.6151 0.6501 15.7919 10.5261 2.0781 93.6299 0.2173 1.1138 0.2081 0.6418 4.5161 0.4877 12.0026 11.2381 47.4476 9.7834 47.1842 4.2636 0.5267 28.3481 27.3481 17.5527 4.3644 7.0222 16.4891 14.6683 25.0804 3.2284 37.1152 25.2834 10.2292 4.0086 5.8425 2.3398 14.3073 6.5462 13.2656 1.9929 4.7667 32.4150 52.4382 18.7283 20.1319 31.9779 1.0638 48.7472 25.1721 8.6521 3.8589 0.0378 17.4706 37.2485 18.6456 3.5409 8.7164
temp: 298.150 k
press: 1.00000 atm
elementType: 8 8 6 6 6 6 6 6 6 6 6 6 6 1 1 1 1 1 1 1 1 1 1 1 1 1 1 1 1
symmnumber: 1
zpe: 642654.4 jmol-1
zpe.correction: 0.244774 hartree
zpe.thermalcorrener: 0.258534 hartree
zpe.thermalcorrenthalpy: 0.259478 hartree
zpe.thermalcorrgfe: 0.204753 hartree
zpe.sumelectzpe: -578.198779 hartree
zpe.sumelectthermal: -578.185019 hartree
zpe.sumelectthermalent: -578.184075 hartree
zpe.sumelectthermalfe: -578.238800 hartree
dipole: -2.1676 0.9243 -0.3039
dipole: 2.3759
quadrupole: -77.9908 -87.7616 -72.3051
quadrupole: 0.3184 -2.9127 0.2067
quadrupole: 1.3617 -8.4091 7.0474 0.3184 -2.9127 0.2067
hfenergy: -578.4435532 hartree
pointgroup: C01 [X(C11H16O2)]
dipole: -0.9132424 -0.1975148 0.0273308 debye
polarizability: 154.9085039|-16.9689062|97.7095762|6.8845871|11.3664491|113.4398657 unknown
InChI: InChI=1S/C11H16O2/c1-11(2,13)10(8-12)9-6-4-3-5-7-9/h3-7,10,12-13H,8H2,1-2H3
charge 0 multiplicity 1
29 atoms
O  1.449129 1.857887 0.405829
O  2.338123 -2.594753 0.254809
C  0.82586 -0.553508 0.366289
C  1.865447 0.534693 -0.136112
C  -0.624106 -0.125212 0.108435
C  1.068232 -1.989191 -0.174526
C  1.948242 0.623697 -1.675858
C  3.259776 0.324923 0.47877
C  -1.328821 0.605448 1.104103
C  -1.303647 -0.427138 -1.103874
C  -2.663456 1.022248 0.898094
C  -2.638715 -0.013462 -1.312145
C  -3.324694 0.714472 -0.313217
H  0.960332 -0.585494 1.469242
H  0.216574 -2.631989 0.132933
H  1.129472 -2.006132 -1.274737
H  0.953498 0.789761 -2.128976
H  2.593137 1.476993 -1.948757
H  2.388259 -0.289788 -2.114682
H  3.698787 -0.626286 0.139713
H  3.91321 1.164523 0.184012
H  3.194319 0.321276 1.581879
H  0.534911 2.059759 0.073913
H  -0.825246 0.840462 2.048797
H  -0.794783 -0.992983 -1.89237
H  -3.185568 1.583286 1.681427
H  -3.14272 -0.261242 -2.253216
H  2.367549 -2.606351 1.24495
H  -4.3604 1.033399 -0.47453
