program: Gaussian 09
title: 000268692
version: EM64L-G09RevD.01
frameworkgroup: C1[X(C20H26N2)]
method: RPBEPBE
basis: SDD
operation: Freq
keyword: #pfreq=noraman
keyword: PBEPBE/SDD
title: #p freq=noraman PBEPBE/SDD
converged: YES YES NO NO
title: Mulliken charges:
elementType: N N C C C C C C C C C C C C C C C C C C C C H H H H H H H H H H H H H H H H H H H H H H H H H H
charge: -0.254610 -0.090079 0.258448 -0.528057 -0.434082 0.257098 0.218439 -0.769075 -0.454604 -0.425060 0.395400 -0.362179 -0.350196 -0.272204 -0.239072 -0.392109 -0.362105 -0.622861 -0.606375 -0.227239 -0.230900 -0.263993 0.227365 0.234046 0.249633 0.186559 0.218936 0.238261 0.216972 0.212433 0.219382 0.233377 0.189198 0.203673 0.251462 0.222576 0.220547 0.250883 0.240539 0.225369 0.188743 0.223330 0.221224 0.186397 0.224983 0.222206 0.220779 0.226541
chargesum: 0.00000
title: Mulliken charges with hydrogens summed into heavy atoms:
elementType: N N C C C C C C C C C C C C C C C C C C C C
charge: -0.254610 -0.090079 0.258448 -0.066646 0.002111 0.257098 0.218439 -0.094905 -0.022789 -0.191682 0.395400 0.030692 -0.098734 -0.049628 -0.018525 -0.141226 -0.121566 0.014580 0.026228 -0.005033 -0.010121 -0.037452
polarizability: 2.83672831e+02 3.43062433e+01 2.78406404e+02 1.51979109e+01 -1.09908728e+01 1.53307105e+02
1716.lowfreq: -4.4071 -0.0007 -0.0006 -0.0006 3.4754 7.9391 26.4571 31.3143 39.7865
frequency: 25.9915 31.0277 39.7647 51.2369 60.3052 71.4180 99.0576 123.0781 127.5368 177.2953 201.9126 210.1580 220.2971 240.5266 253.7180 261.6797 279.4216 288.6648 301.6294 316.2118 347.8999 356.9719 377.8221 391.3226 411.5961 424.1575 472.4205 495.6124 504.4179 542.9961 565.9127 574.5456 609.4785 614.8719 646.8082 695.2296 721.0579 734.9598 741.7001 749.1869 755.0048 756.7173 801.4644 824.2139 856.3525 857.9053 886.7667 896.1929 905.4754 930.7041 944.3698 956.2145 960.1820 969.1284 978.8278 980.2000 982.7271 1010.8403 1024.9396 1027.4280 1033.9191 1052.7339 1058.7695 1071.8341 1085.7761 1092.3040 1097.0465 1108.9888 1117.9133 1136.4268 1159.2118 1169.7927 1171.7691 1182.2331 1196.4786 1201.7379 1214.9675 1234.5654 1253.2313 1262.5610 1275.7247 1288.0326 1303.9949 1312.4304 1324.4653 1331.6468 1359.5491 1365.2788 1369.4688 1379.5602 1383.3407 1405.6564 1417.3488 1441.3870 1443.2224 1453.2983 1457.6548 1461.5335 1465.2464 1466.5236 1472.8177 1474.3032 1475.4490 1482.6016 1484.5992 1486.6494 1491.3610 1501.5036 1577.0631 1597.7670 1608.7300 1622.0038 2825.0748 2840.9494 2858.1008 2929.7991 2969.4443 2975.5104 2981.0399 3005.3949 3018.0692 3025.5340 3026.5243 3044.1543 3050.5120 3072.0034 3076.8054 3077.3738 3081.7463 3122.0640 3123.2868 3130.4524 3131.7180 3151.0857 3156.2741 3161.6483 3170.4427 3177.6618
redmass: 3.9984 2.7932 3.4335 4.1735 3.8126 3.3388 3.6736 3.8552 2.6837 2.7969 1.5199 3.8444 1.5203 1.9471 1.8425 1.3066 2.1922 2.9072 2.4743 2.8362 3.7010 2.0198 3.8422 2.3906 2.9669 2.0915 3.1272 3.2032 3.0706 3.5667 3.6688 4.6733 5.6109 6.4399 4.4241 1.9392 4.5105 2.0149 2.9214 1.3356 3.4152 2.0161 1.9110 1.2750 1.7805 1.7016 1.4095 2.0854 3.0524 1.3978 2.1680 1.7716 1.4192 1.3433 1.4183 2.4079 2.6289 1.8637 2.1240 2.5421 1.5020 2.1230 2.9170 2.4837 1.4938 1.7899 1.7256 1.8558 1.7450 1.5140 1.5808 1.1494 1.0737 1.6205 1.2361 2.1350 1.5220 2.0414 2.1160 2.0135 1.9319 1.5567 1.2458 1.3001 1.5354 1.4806 1.6025 3.0108 1.3596 4.6366 1.2498 4.0363 1.1422 1.1645 2.4474 2.2829 1.0913 1.0560 1.1867 1.4816 1.0725 1.0558 1.0789 1.2414 1.0923 1.1106 1.1825 3.2248 6.0491 7.2460 6.5838 6.5803 1.0702 1.0576 1.0581 1.0682 1.0618 1.0367 1.0608 1.0870 1.0717 1.0891 1.0771 1.0949 1.1008 1.0995 1.1010 1.1001 1.1003 1.0859 1.0846 1.0889 1.0901 1.0926 1.0959 1.0966 1.0989 1.0951
irintensity: 0.0202 0.2794 0.5193 0.2112 0.4955 0.0686 0.5825 0.2972 0.8128 2.4532 0.1851 1.0149 0.1936 0.6854 1.4617 0.0095 0.5057 0.3495 5.1123 4.6651 0.8423 5.8006 0.8103 0.8880 2.9915 0.6446 8.4769 9.5100 7.6622 2.7156 0.5311 6.5326 6.2759 0.8794 2.8804 43.7099 0.9055 8.3684 3.3231 122.7135 5.9218 27.4408 9.3164 0.5983 3.5381 3.4340 3.3272 4.2881 0.6253 1.3042 12.6764 3.5940 1.0020 0.7124 0.4579 8.1231 2.8926 16.4335 17.8149 1.1956 18.4227 5.6396 11.8632 6.3762 7.3077 11.4981 23.1520 6.6577 10.1679 4.0656 1.2426 3.4307 0.1389 11.9039 5.3272 11.8770 23.5786 22.1267 2.8377 8.4989 4.6271 28.9488 2.4625 2.6611 38.8497 22.4523 12.5166 101.9931 9.6812 3.7426 18.0738 10.9259 2.1762 3.3460 19.6832 29.3085 6.9437 9.9052 12.1202 14.3841 1.8907 20.1115 21.4773 15.4211 6.9745 16.9627 5.7103 467.6118 4.6659 9.7247 259.0772 39.7361 72.8020 70.8227 294.4460 75.1798 7.4418 24.1451 35.4090 23.6608 38.4027 10.9666 42.8391 15.0162 62.1549 41.4199 14.2305 42.8767 52.8103 7.3462 7.0024 7.6643 23.8787 39.1320 47.5487 13.4003 5.4218 13.5843
temp: 298.150 k
press: 1.00000 atm
elementType: 7 7 6 6 6 6 6 6 6 6 6 6 6 6 6 6 6 6 6 6 6 6 1 1 1 1 1 1 1 1 1 1 1 1 1 1 1 1 1 1 1 1 1 1 1 1 1 1
symmnumber: 1
zpe: 1081009.6 jmol-1
zpe.correction: 0.411735 hartree
zpe.thermalcorrener: 0.432977 hartree
zpe.thermalcorrenthalpy: 0.433922 hartree
zpe.thermalcorrgfe: 0.360728 hartree
zpe.sumelectzpe: -885.582222 hartree
zpe.sumelectthermal: -885.560980 hartree
zpe.sumelectthermalent: -885.560035 hartree
zpe.sumelectthermalfe: -885.633229 hartree
dipole: 2.3055 -1.0778 0.7559
dipole: 2.6549
quadrupole: -121.7406 -126.4741 -137.0434
quadrupole: -2.4581 2.8849 0.3946
quadrupole: 6.6788 1.9453 -8.6241 -2.4581 2.8849 0.3946
hfenergy: -885.9939569 hartree
pointgroup: C01 [X(C20H26N2)]
dipole: 0.8907562 0.457298 -0.29734 debye
polarizability: 287.033604|-34.0853471|274.7666813|-12.3528305|-14.804656|153.5860548 unknown
InChI: InChI=1S/C20H26N2/c1-20(14-9-15-21(2)3)16-22(17-10-5-4-6-11-17)19-13-8-7-12-18(19)20/h4-8,10-13H,9,14-16H2,1-3H3
charge 0 multiplicity 1
48 atoms
N  -1.260716 0.065419 -0.132028
N  4.588459 1.291332 0.787529
C  0.923273 -0.566685 -0.973311
C  0.041688 0.656592 -0.546932
C  2.410064 -0.379306 -0.570278
C  0.241221 -1.703148 -0.197276
C  -1.053949 -1.290169 0.230422
C  0.765514 -0.837272 -2.498998
C  3.125439 0.820922 -1.230355
C  0.701869 -2.99797 0.076087
C  -2.436246 0.836959 -0.035868
C  4.551429 1.033104 -0.672728
C  -1.885049 -2.171413 0.961571
C  -0.12837 -3.897954 0.796375
C  -1.404405 -3.476108 1.234245
C  -3.732907 0.242761 -0.088566
C  -2.348187 2.257373 0.066312
C  3.991802 2.58723 1.166544
C  5.946176 1.130187 1.345598
C  -4.889289 1.044649 -0.018939
C  -3.514039 3.047642 0.129866
C  -4.795701 2.452019 0.09609
H  0.51266 1.191864 0.306982
H  -0.114514 1.376281 -1.369842
H  2.482297 -0.264979 0.528056
H  2.96914 -1.30392 -0.823253
H  1.301846 -1.760392 -2.785659
H  -0.300135 -0.968924 -2.760301
H  1.166266 -0.001466 -3.10168
H  3.215369 0.668659 -2.32378
H  2.529739 1.74575 -1.095858
H  1.698777 -3.313853 -0.25306
H  5.048268 1.86133 -1.245241
H  5.142593 0.114847 -0.859816
H  -2.857404 -1.857869 1.348749
H  0.222964 -4.910448 1.021608
H  -2.036568 -4.164372 1.807299
H  -3.834784 -0.835795 -0.23443
H  -1.367858 2.742068 0.113709
H  2.930972 2.628915 0.864345
H  4.516658 3.46443 0.706186
H  4.03036 2.702711 2.264411
H  5.913299 1.249467 2.443589
H  6.685798 1.869294 0.942091
H  6.321951 0.115474 1.123314
H  -5.873311 0.564202 -0.071411
H  -3.417876 4.136469 0.213352
H  -5.699082 3.068394 0.149682
