program: Gaussian 09
title: 000268663
version: EM64L-G09RevD.01
frameworkgroup: C1[X(C16H19NO3)]
method: RPBEPBE
basis: SDD
operation: Freq
keyword: #p
keyword: freq=noraman
keyword: PBEPBE/SDD
title: #p freq=noraman PBEPBE/SDD
converged: YES YES NO NO
title: Mulliken charges:
elementType: O O O N C C C C C C C C C C C C C C C C H H H H H H H H H H H H H H H H H H H
charge: -0.240181 -0.245078 -0.252704 -0.616628 0.364636 -0.352331 -0.497624 -0.487773 -0.448165 -0.410034 -0.396546 -0.390469 0.514451 0.182684 0.204966 -0.448959 -0.395226 -0.228024 -0.244886 -0.243359 0.282491 0.215150 0.244903 0.237083 0.213327 0.322422 0.198987 0.225767 0.223419 0.199797 0.207210 0.188602 0.237517 0.245761 0.336057 0.364911 0.228139 0.228933 0.230774
chargesum: 0.00000
title: Mulliken charges with hydrogens summed into heavy atoms:
elementType: O O O N C C C C C C C C C C C C C C C C
charge: -0.240181 -0.245078 -0.252704 0.084339 0.364636 -0.069840 -0.037571 -0.037363 -0.125743 0.014721 0.026670 0.005343 0.514451 0.182684 0.204966 -0.211442 -0.149465 0.000115 -0.015953 -0.012585
polarizability: 2.01255104e+02 1.39503541e+01 1.63246645e+02 -1.64915582e+00 -8.85393918e+00 1.67016322e+02
1716.lowfreq: -11.6310 -6.5671 -0.0007 -0.0006 -0.0001 10.3700 37.4214 40.9515 63.4892
frequency: 37.3261 40.8633 63.4862 69.3875 80.4453 92.9655 101.7358 174.5745 200.0637 215.7368 233.0269 245.3304 264.2654 293.6292 337.0897 371.3933 400.9691 405.0370 408.4540 462.3444 475.7471 500.6593 530.8619 550.7215 565.3197 595.7181 610.5697 619.1817 634.1001 657.9035 690.2068 708.0800 713.6019 752.6981 772.4204 796.2390 818.4801 826.5047 848.2532 856.5530 886.2326 896.6489 916.6735 924.1621 927.8225 929.1902 954.1685 978.6148 990.7495 997.1631 1027.4344 1045.4786 1061.5805 1070.1109 1086.5457 1088.4111 1096.5039 1098.1657 1125.3272 1148.4982 1153.7151 1173.4625 1193.4193 1200.5124 1214.7171 1221.2738 1238.6929 1248.5721 1267.0555 1277.6492 1292.0359 1312.7107 1321.0863 1328.6654 1339.5349 1343.5654 1345.5440 1359.0800 1366.4136 1389.1743 1445.4938 1447.7899 1456.4367 1463.8234 1468.3267 1476.6461 1484.5289 1590.7088 1595.1131 1613.2231 1651.3066 1657.5285 2965.7254 2977.0606 2986.9490 2990.5707 2991.2933 3019.2950 3023.4365 3034.3224 3040.3430 3048.1400 3055.6849 3064.4999 3117.2224 3119.2951 3134.6710 3146.0264 3164.6351 3450.7496 3636.6207
redmass: 5.3899 4.0020 6.3394 4.4263 4.1856 4.1476 5.0366 5.5204 4.0130 2.6124 4.5607 4.3230 3.2554 4.0339 2.8130 2.6422 3.2920 2.8731 3.4799 2.9825 3.5909 2.0150 2.8287 3.2341 4.3167 3.1715 5.5347 4.1934 3.2960 2.4046 1.1176 1.8139 3.6115 2.6171 1.5410 3.3354 2.9763 3.6844 1.8953 1.2459 5.7108 3.0705 1.6765 2.0670 1.8259 2.2621 2.5759 1.4152 5.7089 1.3176 2.2880 2.3009 2.1277 1.8261 1.6377 1.7174 2.1076 1.5944 2.2854 1.8545 3.1917 1.0561 1.1666 2.0157 1.3608 1.7097 1.4939 1.3972 1.2431 1.3058 1.6584 1.5590 3.3483 1.4894 1.3711 1.4791 1.4823 1.7415 1.4957 3.2653 1.8360 1.1581 1.0979 1.0851 1.0837 1.0916 2.2687 3.3788 1.8959 5.9901 4.4159 6.2152 1.0638 1.0626 1.0639 1.0630 1.0617 1.0833 1.0838 1.0962 1.0975 1.1018 1.1016 1.0990 1.0870 1.0874 1.0906 1.0957 1.1014 1.0507 1.0999
irintensity: 0.4868 0.2077 5.8667 0.5524 1.1407 0.9798 2.1168 14.6690 3.7017 1.0686 0.4867 0.5052 2.7527 7.3292 4.1717 0.6520 1.7469 0.1143 0.7924 2.5100 2.6356 6.7569 35.8133 20.9679 5.7134 15.7467 6.6248 15.8286 43.3040 80.4976 131.4873 53.2368 21.5144 33.2504 0.5796 20.6348 11.0577 1.7203 15.3023 0.0116 47.3280 33.5222 7.0961 0.8363 1.7669 3.5714 3.0394 0.2023 0.5723 0.0594 5.0400 2.2976 21.2361 3.1895 14.2997 7.0500 52.5340 1.3364 47.8403 25.8845 206.2968 0.8870 0.1801 15.1570 6.1695 3.1552 6.6906 0.9152 5.1836 3.4318 10.0334 0.9432 134.8391 6.9108 0.4198 7.1233 0.5455 1.3556 12.7392 0.3996 5.2683 10.4134 6.4368 9.5097 12.6262 7.6345 19.5231 53.8642 178.5089 5.5376 229.6213 304.1051 39.3064 8.7365 33.7750 19.6595 33.6136 1.5397 5.6395 70.0771 38.4208 13.0003 44.0240 38.0701 9.2806 4.5457 8.8191 32.7077 24.1019 54.2195 67.1870
temp: 298.150 k
press: 1.00000 atm
elementType: 8 8 8 7 6 6 6 6 6 6 6 6 6 6 6 6 6 6 6 6 1 1 1 1 1 1 1 1 1 1 1 1 1 1 1 1 1 1 1
symmnumber: 1
zpe: 844418.6 jmol-1
zpe.correction: 0.321622 hartree
zpe.thermalcorrener: 0.339190 hartree
zpe.thermalcorrenthalpy: 0.340134 hartree
zpe.thermalcorrgfe: 0.275701 hartree
zpe.sumelectzpe: -900.089884 hartree
zpe.sumelectthermal: -900.072316 hartree
zpe.sumelectthermalent: -900.071372 hartree
zpe.sumelectthermalfe: -900.135805 hartree
dipole: 1.3651 1.0085 -0.6517
dipole: 1.8180
quadrupole: -109.7024 -111.1099 -127.7542
quadrupole: 3.9232 4.8211 -5.6150
quadrupole: 6.4864 5.0790 -11.5653 3.9232 4.8211 -5.6150
hfenergy: -900.4115058 hartree
pointgroup: C01 [X(C16H19N1O3)]
dipole: 0.289481 0.6452538 -0.106993 debye
polarizability: 178.8967757|22.8835115|186.596929|8.7463801|-2.4612496|166.0243673 unknown
InChI: InChI=1S/C16H19NO3/c17-14(18)12-13(11-7-3-1-4-8-11)16(20-15(12)19)9-5-2-6-10-16/h1,3-4,7-8,12-13H,2,5-6,9-10,17H2
charge 0 multiplicity 1
39 atoms
O  -1.331477 -0.500175 1.141841
O  -0.73533 -2.63277 1.827077
O  0.609545 -2.160678 -2.310057
N  0.238346 -3.780771 -0.675806
C  -0.953869 0.459355 0.004769
C  0.512776 0.015592 -0.396353
C  -1.114914 1.8782 0.5718
C  -1.948942 0.19587 -1.150616
C  0.582424 -1.459275 0.065607
C  -2.581255 2.200776 0.948057
C  -3.410769 0.505121 -0.757679
C  -3.547393 1.953441 -0.234033
C  1.633436 0.879563 0.1729
C  -0.535858 -1.631566 1.102268
C  0.46447 -2.492496 -1.098502
C  2.33431 1.766802 -0.682078
C  2.001047 0.833556 1.54453
C  3.37378 2.58682 -0.187763
C  3.039475 1.65049 2.042997
C  3.729998 2.532011 1.178854
H  0.582676 0.031173 -1.499302
H  -0.75787 2.588978 -0.200712
H  -0.455383 2.007857 1.44744
H  -1.845729 -0.845726 -1.50898
H  -1.646734 0.848594 -1.99494
H  1.542941 -1.682464 0.566493
H  -2.645934 3.252333 1.286831
H  -2.88005 1.563923 1.802644
H  -3.73444 -0.202798 0.029385
H  -4.0685 0.344176 -1.63289
H  -4.59022 2.149367 0.080396
H  -3.319357 2.665063 -1.055246
H  2.071887 1.80405 -1.746601
H  1.474239 0.162361 2.234471
H  0.180379 -4.524037 -1.37099
H  0.037048 -3.974541 0.310896
H  3.907648 3.260332 -0.867522
H  3.308746 1.600846 3.104067
H  4.537355 3.163746 1.565345
