program: Gaussian 09
title: 000268620
version: EM64L-G09RevD.01
frameworkgroup: C1[X(C11H10O4S)]
method: RPBEPBE
basis: SDD
operation: Freq
keyword: #p
keyword: freq=noraman
keyword: PBEPBE/SDD
title: #p freq=noraman PBEPBE/SDD
converged: NO YES NO NO
title: Mulliken charges:
elementType: S O O O O C C C C C C C C C C C H H H H H H H H H H
charge: 0.308611 -0.303318 -0.294754 -0.431909 -0.245465 0.722279 -0.433027 -0.549021 0.219520 -0.402728 0.218523 -0.361053 -0.216907 0.172781 -0.528418 -0.528929 0.269408 0.273350 0.293207 0.233395 0.225553 0.252167 0.226978 0.259222 0.233572 0.386964
chargesum: 0.00000
title: Mulliken charges with hydrogens summed into heavy atoms:
elementType: S O O O O C C C C C C C C C C C
charge: 0.308611 -0.303318 -0.294754 -0.044945 -0.245465 0.722279 -0.433027 -0.279613 0.219520 -0.129378 0.218523 -0.067846 -0.216907 0.172781 0.182697 0.190842
polarizability: 2.81450041e+02 1.74224215e+00 1.45023710e+02 1.49247601e+00 7.18872885e+00 7.27231594e+01
1716.lowfreq: -7.7070 -1.8658 -0.0023 -0.0014 -0.0011 5.1845 50.0641 62.8368 85.3110
frequency: 50.0130 62.8352 85.2940 101.5944 107.7006 114.4242 152.8170 157.0726 175.7313 211.3678 242.7890 268.0578 284.5932 294.7116 352.2959 374.9572 410.3519 418.6582 474.4068 479.8078 499.3409 565.7723 574.8028 620.5636 653.5873 676.2327 688.8022 712.2960 719.5027 746.9824 775.6447 873.6663 876.9577 907.6189 918.2984 944.2286 956.4622 1012.7723 1099.3805 1111.9709 1114.0762 1124.6493 1147.6302 1157.0568 1177.1229 1214.5681 1232.4024 1292.4268 1308.0546 1368.6624 1397.4607 1424.3337 1442.7692 1457.3942 1458.2335 1466.9628 1476.4592 1486.7464 1515.2814 1557.7837 1610.7109 1643.1259 2974.6750 2980.6691 3071.8242 3081.2533 3124.9058 3128.9319 3160.6801 3168.6086 3192.3663 3531.3525
redmass: 4.4921 7.6816 4.9514 4.7403 2.8854 5.7283 1.2405 1.0986 2.8126 4.6305 5.6501 7.1228 7.7886 6.8339 7.4246 6.4128 6.8589 5.3308 4.3362 3.6884 5.0631 1.2679 5.6796 5.2550 5.7698 6.3042 5.2549 6.9515 7.4585 2.8980 5.7068 1.4925 1.4679 4.8497 1.7482 7.0598 7.2005 3.9636 2.1196 1.2627 1.2464 2.0828 1.3822 1.5542 1.8327 1.5729 1.5700 7.3767 3.4936 4.8203 3.1696 1.2507 1.5302 1.2311 1.0956 2.1000 1.0716 1.0542 8.9540 7.9669 7.3793 8.5026 1.0306 1.0308 1.1045 1.1038 1.1027 1.1035 1.0926 1.0928 1.0952 1.0643
irintensity: 1.3673 0.4013 2.6274 0.6512 11.3581 0.6901 0.7052 0.3371 6.4088 3.3671 6.0940 3.0818 2.3847 7.0947 1.2635 3.0769 10.4740 6.9330 21.0238 34.0686 10.9543 105.6548 52.6970 6.9150 13.9951 9.3618 13.8896 22.1632 21.2509 5.9264 4.2440 3.1140 11.0573 14.0757 72.3310 213.2837 99.2961 18.2601 228.7201 53.9110 1.6176 180.4845 7.4762 17.8927 49.0575 41.5696 43.1395 222.9749 62.9598 21.4823 27.5076 0.3006 33.0548 21.2282 10.5679 31.1021 7.8431 22.6954 156.3915 20.8721 72.1416 494.9159 74.6780 80.6260 26.7564 21.9027 24.7421 21.1294 2.0279 1.5644 0.8189 65.2872
temp: 298.150 k
press: 1.00000 atm
elementType: 16 8 8 8 8 6 6 6 6 6 6 6 6 6 6 6 1 1 1 1 1 1 1 1 1 1
symmnumber: 1
zpe: 491925.6 jmol-1
zpe.correction: 0.187365 hartree
zpe.thermalcorrener: 0.202885 hartree
zpe.thermalcorrenthalpy: 0.203829 hartree
zpe.thermalcorrgfe: 0.144252 hartree
zpe.sumelectzpe: -1122.938835 hartree
zpe.sumelectthermal: -1122.923314 hartree
zpe.sumelectthermalent: -1122.922370 hartree
zpe.sumelectthermalfe: -1122.981947 hartree
dipole: 3.6106 2.0636 0.3309
dipole: 4.1718
quadrupole: -90.5662 -96.6568 -100.6505
quadrupole: -11.3272 -2.1000 -4.3681
quadrupole: 5.3916 -0.6990 -4.6927 -11.3272 -2.1000 -4.3681
hfenergy: -1123.1261993 hartree
pointgroup: C01 [X(C11H10O4S1)]
dipole: 1.409381 -0.8027267 -0.2513767 debye
dipolederiv: -0.1208601 -0.003061 -0.0050582 0.135641 -0.1184658 -0.0811325 0.0462214 -0.0834042 0.0973952 -1.3609742 0.3930469 -0.1752632 0.4447664 -0.571052 0.1124372 -0.0648631 0.0838422 -0.384419 -1.7398806 -0.3370163 0.2380663 -0.3440639 -0.4855613 0.096711 0.0103959 0.0596148 -0.3782548 -0.7768138 -0.3932124 -0.1252086 -0.7944584 -0.9786387 -0.1741854 -0.2596564 -0.1812394 -0.4829677 -1.2682344 0.2298923 0.0850505 0.307077 -0.7054576 -0.1297037 0.1046009 -0.1252907 -0.3715696 -0.3704554 -0.1653699 -0.0424421 -0.116099 -0.1800958 -0.0655941 -0.037001 -0.0696607 0.026552 0.468037 -0.1896557 -0.0777404 0.018072 0.0199552 0.0430607 -0.0140372 0.0589135 -0.107149 0.1075046 0.1653444 0.0014422 -0.0558291 0.0163591 0.080838 -0.0934054 0.0839806 -0.1247165 0.8001138 -0.4488978 0.0436076 -0.9299578 0.2509763 -0.0565954 -0.3387627 0.0395838 -0.048233 -0.4443829 0.0236417 0.0655977 0.143144 -0.0006337 0.0561838 0.1767027 0.0610725 -0.0947498 1.1866417 0.2915981 -0.1208069 0.6803205 0.3812297 -0.0163497 0.2687346 0.0775299 -0.0372685 0.6262403 0.2087393 0.0565918 -0.1066407 -0.1278187 -0.0061545 -0.0361328 -0.0174249 -0.1054509 -1.4815462 0.0571776 0.0411187 0.3013842 0.3467254 0.164453 0.1089089 0.1580589 -0.0799414 2.6452553 0.1157016 0.0129081 0.3173353 1.2471466 0.3242277 0.0861163 0.3252404 0.3678053 0.5904682 -0.169417 0.1434494 -0.049985 0.2783607 -0.1040385 0.3915096 -0.2513717 0.4144555 0.7289671 0.1499845 -0.1673149 -0.0581544 0.2303041 -0.0813824 -0.446378 -0.2090666 0.4283016 0.0843901 -0.0183714 0.0017105 0.0133595 -0.0176385 -0.0510221 0.0136127 -0.0503116 0.1518866 0.084472 0.0118844 -0.0003738 -0.0272046 0.001026 -0.0437667 -0.0089334 -0.0470595 0.1538377 0.1158842 0.0140192 0.0060933 -0.0494408 0.0335882 -0.048905 -0.0157957 -0.0489756 0.1686765 -0.103381 0.1271025 0.0215857 0.1390119 0.0399787 -0.0130128 0.0458503 -0.0322169 0.0566603 0.0048166 -0.0919915 0.0853843 -0.023061 -0.0018276 0.1073206 -0.0681818 0.1421466 -0.0651187 0.0700013 -0.024131 -0.0387782 -0.1189302 -0.0209624 -0.0951969 -0.0719157 -0.0250198 0.0155942 0.0038204 0.0808474 -0.073163 0.0181962 -0.0041667 0.1155423 0.119034 0.1380838 -0.0756837 0.0779853 0.0187485 0.0223176 0.1108718 -0.0158615 -0.0953013 0.0712085 -0.0302613 0.0276098 -0.1314291 -0.1058729 -0.0185605 -0.1201602 0.0676122 -0.0090231 -0.0441637 -0.0286797 0.0560446 0.2033597 0.0592684 0.0197862 0.164805 0.3149183 -0.0294099 0.0563309 -0.0280844 0.3907033 unknown
polarizability: 281.3414998|-2.8158649|141.962058|-3.8544378|16.384495|75.8933524 unknown
InChI: InChI=1S/C11H10O4S/c1-14-7-3-6-4-10(11(12)13)16-9(6)5-8(7)15-2/h3-5,12H,1-2H3
charge 0 multiplicity 1
26 atoms
S  -1.997917 1.564045 0.54821
O  3.13602 -1.42783 -0.453608
O  3.282547 1.353696 0.394474
O  -4.675548 -1.3527 -0.400301
O  -5.025174 0.837355 0.322488
C  -0.473259 -0.545084 -0.16443
C  -0.371803 0.815614 0.282333
C  0.720748 -1.281925 -0.398594
C  1.966399 -0.671584 -0.205099
C  0.874627 1.44634 0.45671
C  2.046253 0.709528 0.19372
C  -1.841293 -0.979511 -0.295995
C  -2.767232 -0.002724 0.034901
C  -4.227126 -0.084004 0.017006
C  3.962226 -1.688286 0.751053
C  4.15232 1.451876 -0.805636
H  0.688896 -2.3288 -0.715718
H  0.972393 2.488464 0.772853
H  -2.145958 -1.97573 -0.623291
H  4.834976 -2.252831 0.389936
H  3.39169 -2.298178 1.476372
H  4.280777 -0.741792 1.223739
H  3.670833 2.097617 -1.563303
H  4.352671 0.453236 -1.231062
H  5.082524 1.919295 -0.449834
H  -5.670191 -1.347588 -0.394324
