program: Gaussian 09
title: 000268614
version: EM64L-G09RevD.01
frameworkgroup: C1[X(C17H17N)]
method: RPBEPBE
basis: SDD
operation: Freq
keyword: #pfreq=noraman
keyword: PBEPBE/SDD
title: #p freq=noraman PBEPBE/SDD
converged: NO YES NO NO
title: Mulliken charges:
elementType: N C C C C C C C C C C C C C C C C C H H H H H H H H H H H H H H H H H
charge: -0.025639 0.083005 -0.437175 0.119905 0.178764 -0.420931 -0.545951 -0.400620 -0.757449 -0.057853 0.216474 0.424773 -0.367190 -0.476830 -0.400966 -0.454858 -0.271500 -0.246170 0.204304 0.224102 0.198419 0.216390 0.219464 0.244206 0.216226 0.215733 0.225677 0.243305 0.217540 0.256474 0.240096 0.225164 0.240605 0.225258 0.227249
chargesum: 0.00000
title: Mulliken charges with hydrogens summed into heavy atoms:
elementType: N C C C C C C C C C C C C C C C C C
charge: -0.025639 0.083005 -0.008769 0.119905 0.178764 -0.006123 -0.082280 0.031339 -0.070927 -0.057853 0.216474 0.424773 -0.110716 -0.236734 -0.175802 -0.214253 -0.046242 -0.018921
polarizability: 2.68090316e+02 -1.04732897e+01 1.98854100e+02 -7.49672106e+00 -4.09713269e+00 1.05288807e+02
1716.lowfreq: -4.4309 -1.5989 -0.0006 -0.0005 -0.0005 11.5321 70.8209 73.3693 138.3475
frequency: 70.8180 73.2781 138.2839 149.7473 169.2426 197.4701 210.2543 228.3554 274.2730 285.6203 316.3499 347.9307 368.9523 386.7061 430.3582 434.7694 475.9667 509.7182 536.0202 548.8399 571.3497 583.8544 607.7464 657.1258 678.3543 706.6008 739.5124 751.7640 759.9041 802.2551 806.7718 834.8967 840.6114 844.6211 880.8035 896.8631 913.6910 940.1062 954.9170 964.0088 972.4571 974.9791 989.5367 999.3568 1025.2708 1030.7088 1079.7126 1095.0837 1109.6930 1123.0468 1138.3170 1144.5497 1156.7771 1174.7024 1203.5922 1222.6837 1238.9187 1241.0132 1250.2215 1268.6083 1296.6787 1310.6083 1325.7037 1338.8391 1343.2207 1369.1705 1386.5379 1395.0613 1416.1267 1441.5004 1445.3097 1451.2133 1460.1013 1467.5855 1473.4396 1475.7486 1482.1794 1526.7101 1547.6136 1575.3355 1597.6209 1631.4775 2972.7532 2978.7641 2982.8468 2984.5138 2986.9221 3033.0698 3042.3794 3052.3207 3072.8811 3081.6818 3087.4559 3119.6089 3127.9189 3130.6397 3148.8663 3163.1723 3165.3885
redmass: 3.9170 3.5193 2.9109 3.3586 4.5721 1.2495 2.4909 2.2880 2.8279 4.1126 2.6455 2.6564 3.1175 3.9416 3.2170 3.7987 2.4334 5.4129 3.5422 3.8240 3.2274 4.8574 3.6728 5.4254 3.3370 3.1961 5.8795 3.8566 1.3776 2.8878 1.5829 1.8758 2.0002 3.4238 1.7379 1.4941 2.2579 2.7226 1.3548 4.1690 1.9226 1.3837 1.3546 1.9643 2.2225 2.3130 1.9330 1.5319 1.8730 2.3014 1.5222 1.6755 1.6256 1.1140 2.1493 1.9605 2.3358 1.7115 1.3164 1.7407 1.5817 1.5385 1.4587 1.6820 1.4483 2.4258 1.2213 4.4225 3.8181 3.6972 2.2745 1.1079 1.0822 1.0900 1.0664 1.0953 1.0759 4.7284 8.2164 6.7347 7.5324 6.8854 1.0661 1.0584 1.0575 1.0604 1.0419 1.0977 1.1024 1.1026 1.0964 1.0996 1.1000 1.0863 1.0887 1.0882 1.0939 1.0998 1.0962
irintensity: 0.7506 0.2864 0.1936 0.5186 0.1360 0.0535 0.7975 0.4620 1.2882 5.9991 0.2483 0.3634 1.8970 0.1310 7.5397 1.2605 2.7342 0.4465 1.6190 3.7107 4.3515 1.9385 3.2223 1.0129 1.7427 1.0706 0.5731 3.1135 48.9148 0.1171 4.7667 19.5578 52.8999 0.7049 11.0541 2.6968 4.2997 3.8745 2.4660 6.4500 8.2078 0.8284 0.5203 4.6150 6.4007 6.2477 0.9512 0.3047 1.0587 4.6339 2.6876 3.8000 3.1128 0.0489 16.1396 5.1970 10.3143 7.1166 1.4771 0.4707 3.7191 1.2162 0.2912 7.1956 1.6855 7.4949 13.2043 1.0530 3.6926 0.6875 4.2015 15.4494 2.0960 14.1339 8.5053 3.9745 12.7549 29.8538 67.0162 3.1075 1.0536 4.5844 24.3454 17.1963 25.0232 45.8391 39.6655 42.2551 36.9693 62.8442 26.1316 30.3474 16.5219 2.5510 6.5618 10.4410 38.3886 35.5399 11.0292
temp: 298.150 k
press: 1.00000 atm
elementType: 7 6 6 6 6 6 6 6 6 6 6 6 6 6 6 6 6 6 1 1 1 1 1 1 1 1 1 1 1 1 1 1 1 1 1
symmnumber: 1
zpe: 766907.4 jmol-1
zpe.correction: 0.292100 hartree
zpe.thermalcorrener: 0.306218 hartree
zpe.thermalcorrenthalpy: 0.307162 hartree
zpe.thermalcorrgfe: 0.252231 hartree
zpe.sumelectzpe: -711.505067 hartree
zpe.sumelectthermal: -711.490949 hartree
zpe.sumelectthermalent: -711.490005 hartree
zpe.sumelectthermalfe: -711.544935 hartree
dipole: -0.6320 -2.7091 0.0178
dipole: 2.7819
quadrupole: -93.1899 -104.4601 -109.1196
quadrupole: 6.1650 -1.1456 -1.2607
quadrupole: 9.0666 -2.2035 -6.8631 6.1650 -1.1456 -1.2607
hfenergy: -711.7971668 hartree
pointgroup: C01 [X(C17H17N1)]
dipole: -0.2203684 -1.0715658 0.0324846 debye
polarizability: 268.651488|-8.7728899|198.0793595|-6.5311682|-6.6110618|105.5023752 unknown
InChI: InChI=1S/C17H17N/c1-17-11-5-4-8-15(17)18-14-10-9-12-6-2-3-7-13(12)16(14)17/h2-3,6-7,9-10H,4-5,8,11H2,1H3
charge 0 multiplicity 1
35 atoms
N  -1.625632 1.894895 0.084188
C  -1.288236 -0.480065 0.367593
C  -1.725528 -1.478878 -0.759122
C  -2.233248 0.736532 0.292949
C  0.05213 0.215717 0.126657
C  -3.248224 -1.771857 -0.721976
C  -3.719152 0.541453 0.302547
C  -4.095844 -0.480133 -0.817152
C  -1.34781 -1.131894 1.782237
C  -0.214489 1.596065 0.000675
C  1.389835 -0.277086 0.051101
C  2.452963 0.700542 -0.149412
C  0.817221 2.55466 -0.197168
C  2.135436 2.097997 -0.266712
C  1.747604 -1.665621 0.151251
C  3.809638 0.244966 -0.230531
C  3.080689 -2.073344 0.067115
C  4.123223 -1.111788 -0.123338
H  -1.152295 -2.421353 -0.66529
H  -1.463371 -1.03732 -1.740626
H  -3.508495 -2.319217 0.206087
H  -3.503345 -2.445244 -1.562981
H  -4.048358 0.133234 1.280059
H  -4.226215 1.509186 0.150538
H  -5.173317 -0.72133 -0.749149
H  -3.928946 -0.002971 -1.803156
H  -0.633447 -1.971133 1.853754
H  -1.083892 -0.394509 2.56053
H  -2.357053 -1.521341 2.004506
H  0.564264 3.614933 -0.289151
H  2.95759 2.807945 -0.416296
H  0.960498 -2.41433 0.287103
H  4.604919 0.985256 -0.38074
H  3.334584 -3.136539 0.144332
H  5.164606 -1.445628 -0.187219
