program: Gaussian 09
title: 000268628
version: EM64L-G09RevD.01
frameworkgroup: C1[X(C12H8N2O4S2)]
method: RPBEPBE
basis: SDD
operation: Freq
keyword: #p
keyword: freq=noraman
keyword: PBEPBE/SDD
title: #p freq=noraman PBEPBE/SDD
converged: YES YES NO NO
title: Mulliken charges:
elementType: S S O O O O N N C C C C C C C C C C C C H H H H H H H H
charge: 0.405597 1.006047 -0.554062 -0.472690 -0.526638 -0.223697 -0.630890 -0.002574 0.428852 0.675930 -0.821230 -0.371829 -0.348600 -0.271683 -0.353324 -0.231345 -0.226229 0.221715 0.109186 -0.234949 0.265466 0.255095 0.295309 0.244336 0.242623 0.388180 0.389397 0.342008
chargesum: 0.00000
title: Mulliken charges with hydrogens summed into heavy atoms:
elementType: S S O O O O N N C C C C C C C C C C C C
charge: 0.405597 1.006047 -0.165882 -0.472690 -0.526638 -0.223697 0.100515 -0.002574 0.428852 0.675930 -0.821230 -0.371829 -0.083134 -0.016588 -0.058015 0.012991 0.016393 0.221715 0.109186 -0.234949
polarizability: 2.58220326e+02 8.42019252e+00 2.62150246e+02 -5.69383374e+00 7.74064371e-01 1.11328548e+02
1716.lowfreq: -5.1385 -3.4541 -0.0032 -0.0015 -0.0014 6.1567 24.0057 47.8432 55.5895
frequency: 23.7907 47.8301 55.5858 58.6951 68.5385 85.8546 121.6314 132.4323 158.4726 170.2837 179.1184 190.1165 217.0293 218.4036 244.6889 269.6885 304.5408 313.3782 331.1283 366.7725 382.7743 410.0916 426.7826 429.8366 448.3468 483.9588 496.8596 527.5200 546.4641 570.6217 618.9188 632.6873 660.8791 672.1508 683.5325 714.7729 735.3698 744.5063 757.9765 777.2053 809.7828 825.3486 870.5861 905.3050 938.0290 958.9101 965.1228 997.6507 1023.5826 1026.9018 1042.3068 1059.2340 1084.6446 1123.2076 1147.8115 1182.9015 1267.1933 1320.1509 1346.3180 1371.9621 1390.3471 1421.1088 1456.9339 1489.2441 1564.8223 1600.4638 1602.6744 1621.2132 1641.8340 2173.2367 3128.0806 3144.7668 3157.6117 3169.2139 3181.8801 3447.2789 3468.4539 3628.6127
redmass: 8.7752 10.1752 8.4294 8.3871 6.7000 6.8976 9.2052 9.2470 7.0376 5.7926 3.4781 5.6033 6.0823 6.4088 3.2861 3.9241 5.6464 6.3365 5.3413 8.1569 10.4518 10.4715 7.8323 3.6988 5.2393 8.4824 4.3624 3.4539 13.7174 4.9413 2.5726 2.9045 4.1007 4.6060 4.4365 1.3006 3.8879 3.3292 2.9502 2.2931 7.1906 8.8616 1.3938 2.2678 3.4012 1.3772 7.3901 1.3450 2.7194 4.9726 1.1784 4.8644 1.9782 2.4901 1.6444 1.1203 1.5666 3.2221 3.5592 1.5263 5.8067 2.7803 2.8840 7.1478 6.3593 4.6452 2.3461 8.1148 2.0941 12.6298 1.0884 1.0865 1.0904 1.0960 1.0998 1.0515 1.0661 1.1000
irintensity: 1.4157 2.8957 0.3568 6.6463 3.4219 4.2030 0.9217 2.5862 3.3875 0.2780 16.1437 12.5198 3.1509 7.0208 16.6536 27.7328 27.8366 49.5723 0.1942 3.3357 7.4221 56.5687 18.9728 20.5069 10.9523 3.4160 6.1376 13.8790 144.6295 53.6057 46.8540 8.6276 7.1184 30.6756 25.7889 167.2313 40.4350 2.6601 28.4426 30.7902 29.8588 77.1174 0.3630 15.8372 48.6644 0.7925 75.4563 0.0556 9.1566 2.2745 93.8876 1.8603 3.0131 4.8955 6.7770 3.7481 6.3814 196.2644 2.8678 6.7826 0.1369 12.5310 1.5565 52.7692 0.5133 22.1783 109.7539 22.5561 213.8757 3.8398 2.1914 0.9739 3.4286 11.4355 10.6754 78.1846 51.9753 98.7802
temp: 298.150 k
press: 1.00000 atm
elementType: 16 16 8 8 8 8 7 7 6 6 6 6 6 6 6 6 6 6 6 6 1 1 1 1 1 1 1 1
symmnumber: 1
zpe: 471531.8 jmol-1
zpe.correction: 0.179597 hartree
zpe.thermalcorrener: 0.199064 hartree
zpe.thermalcorrenthalpy: 0.200009 hartree
zpe.thermalcorrgfe: 0.130579 hartree
zpe.sumelectzpe: -1666.981245 hartree
zpe.sumelectthermal: -1666.961777 hartree
zpe.sumelectthermalent: -1666.960833 hartree
zpe.sumelectthermalfe: -1667.030262 hartree
dipole: -3.2685 3.0579 -3.2668
dipole: 5.5412
quadrupole: -107.6281 -148.7827 -138.3105
quadrupole: 22.1008 -3.7604 -0.9584
quadrupole: 23.9457 -17.2090 -6.7367 22.1008 -3.7604 -0.9584
hfenergy: -1667.1608417 hartree
pointgroup: C01 [X(C12H8N2O4S2)]
dipole: -1.2019651 1.1465363 -1.4119312 debye
polarizability: 259.4246753|7.6046741|258.8217402|-9.1911013|-16.6790985|113.4527047 unknown
InChI: InChI=1S/C12H8N2O4S2/c13-6-7(11(14)15)5-9-8-3-1-2-4-10(8)19-12(9)20(16,17)18/h1-5,16H,14H2
charge 0 multiplicity 1
28 atoms
S  -2.034783 2.056339 0.140054
S  1.031679 2.582604 -0.133758
O  1.117542 2.737504 -1.986048
O  0.596081 3.994449 0.513408
O  2.40698 1.85919 0.345605
O  3.457962 -3.210527 -0.132258
N  3.905034 -0.911698 -0.153804
N  0.427346 -3.062681 2.098394
C  -1.565457 -0.600183 -0.162616
C  -0.254708 0.037184 -0.244402
C  -0.377729 1.414912 -0.113291
C  -2.628266 0.338647 0.042415
C  -1.891072 -1.977226 -0.311043
C  -3.976834 -0.056684 0.134422
C  1.058097 -0.590298 -0.449962
C  -3.233146 -2.379614 -0.222282
C  -4.268452 -1.430035 0.005232
C  1.618526 -1.640129 0.233513
C  3.075456 -2.010948 -0.036411
C  0.950557 -2.411501 1.242024
H  -1.103089 -2.713609 -0.489935
H  -4.776521 0.672354 0.295821
H  1.703593 -0.08898 -1.181194
H  -3.486583 -3.439086 -0.326222
H  -5.30775 -1.767345 0.07505
H  1.780232 3.456732 -2.20632
H  3.58211 0.037442 0.06305
H  4.894095 -1.07441 -0.344142
