program: Gaussian 09
title: 000268611
version: EM64L-G09RevD.01
frameworkgroup: C1[X(C6H8N2OS2)]
method: RPBEPBE
basis: SDD
operation: Freq
keyword: #p
keyword: freq=noraman
keyword: PBEPBE/SDD
title: #p freq=noraman PBEPBE/SDD
converged: NO NO NO NO
title: Mulliken charges:
elementType: S S O N N C C C C C C H H H H H H H H
charge: 0.261692 0.286822 -0.268457 0.010722 -0.639880 0.388073 -0.412946 -0.736267 -0.501465 0.208738 -0.815691 0.230179 0.252251 0.252499 0.287616 0.246635 0.287630 0.322973 0.338875
chargesum: 0.00000
title: Mulliken charges with hydrogens summed into heavy atoms:
elementType: S S O N N C C C C C C
charge: 0.261692 0.286822 -0.268457 0.010722 0.021968 0.388073 -0.412946 -0.001338 -0.501465 0.208738 0.006189
polarizability: 1.87787336e+02 -4.14104235e+00 1.25484331e+02 1.41872103e-02 2.43077767e-02 5.27894092e+01
1716.lowfreq: -0.0019 0.0011 0.0016 5.8905 10.9996 12.5264 36.1406 51.2374 73.2819
frequency: 36.0904 51.1826 73.2550 86.2825 125.6797 130.2623 187.0504 193.2026 257.6055 264.7720 325.5304 343.4458 415.3309 456.8902 485.5715 513.4124 526.9571 570.9757 633.8885 638.3951 654.2525 657.8777 734.2063 880.1012 946.6784 983.9505 1004.8260 1016.5150 1042.4971 1050.8587 1084.5943 1287.7176 1344.2731 1355.3418 1396.8318 1421.0425 1434.1312 1450.1986 1452.7497 1455.8269 1515.4788 1563.0686 1625.6004 3005.0495 3027.1310 3088.6718 3121.1486 3153.7475 3162.2496 3513.7056 3669.1365
redmass: 2.5629 3.5101 1.3005 6.6774 4.5588 1.0934 3.8625 4.4521 5.0536 5.9082 4.7202 7.6408 9.3371 1.3160 4.9064 3.0354 5.3476 1.4475 6.4640 4.7707 7.2494 5.4336 8.3650 6.5662 3.6193 1.1744 1.3335 2.4821 1.5037 2.6771 2.4467 5.2434 1.2499 4.3458 1.3505 4.2668 1.0522 1.0445 1.0903 1.1018 9.2260 3.4242 1.4543 1.0359 1.0279 1.0963 1.1020 1.1045 1.1061 1.0452 1.1044
irintensity: 10.4828 3.0714 5.6252 0.0458 5.6787 0.1997 1.5084 3.1155 6.0822 0.4921 0.3153 4.1451 13.4123 93.6366 3.9205 84.5865 9.9212 100.8638 28.2695 12.6778 1.6718 5.5281 25.8127 32.3955 70.7132 7.4953 17.8811 4.7578 6.8981 13.7698 3.5434 10.3211 55.1180 284.8858 104.0540 93.6377 16.7267 13.6520 33.0143 36.9693 183.8758 128.6830 259.3395 8.5298 18.1662 6.8829 13.7397 5.2236 8.0828 46.9544 33.9213
temp: 298.150 k
press: 1.00000 atm
elementType: 16 16 8 7 7 6 6 6 6 6 6 1 1 1 1 1 1 1 1
symmnumber: 1
zpe: 355382.0 jmol-1
zpe.correction: 0.135358 hartree
zpe.thermalcorrener: 0.148063 hartree
zpe.thermalcorrenthalpy: 0.149007 hartree
zpe.thermalcorrgfe: 0.094868 hartree
zpe.sumelectzpe: -1213.468724 hartree
zpe.sumelectthermal: -1213.456018 hartree
zpe.sumelectthermalent: -1213.455074 hartree
zpe.sumelectthermalfe: -1213.509214 hartree
dipole: -1.9950 -1.6672 -0.0114
dipole: 2.6000
quadrupole: -73.9171 -73.8210 -81.7849
quadrupole: -14.7207 -0.0416 0.0152
quadrupole: 2.5906 2.6866 -5.2772 -14.7207 -0.0416 0.0152
hfenergy: -1213.6040815 hartree
pointgroup: C01 [X(C6H8N2O1S2)]
dipole: -0.7516994 0.6937376 0.0037947 debye
dipolederiv: -0.4241871 -0.1114118 0.0001115 -0.2530403 -0.4172293 0.0006496 -0.0003859 0.0002138 0.1195053 -0.7577262 -0.0377454 -0.0001663 0.1307254 -0.0094542 0.0001238 -0.00005 0.0000393 -0.0206716 -1.0736304 0.244661 0.0003561 0.223845 -0.8071056 -0.0011125 0.0001405 -0.0011825 -0.3483066 -0.9174188 0.2175697 -0.0005608 0.5707203 -0.8847793 0.0013038 -0.00093 0.0009393 -0.1540427 -0.6606687 -0.4387528 -0.0015238 -0.601844 -0.9637803 -0.0001217 -0.0015314 0.0000215 -0.7025361 0.6130525 -0.2051925 0.0004196 0.0779359 0.5040379 -0.0001536 0.0007199 0.0007622 0.0881378 -0.8403896 -0.349538 0.000088 -0.4526656 0.0216221 -0.0008642 0.0001599 -0.0005762 -0.1894038 0.0583291 0.1847425 -0.0005592 0.089516 -0.1490526 -0.0001312 -0.0011762 -0.0016499 0.0231458 1.3435126 0.0676941 0.0000896 -0.343401 0.6556848 -0.0014246 0.0005207 -0.0010616 -0.1205615 1.9681638 0.2728658 0.0007755 0.4564784 1.4035807 0.0029399 0.001126 0.002801 0.2792344 0.1343725 0.1190789 -0.0000325 0.1758037 0.1041378 0.0000415 -0.0002039 0.0000235 0.0494687 -0.0230542 -0.1648611 0.0014035 -0.0569453 -0.0020242 0.0007877 0.001031 0.001324 0.1168879 0.050969 0.0241789 0.0874754 -0.0071277 0.0600763 0.0041554 0.0744199 -0.0318458 -0.009985 0.0493663 0.0239501 -0.0883269 -0.0077521 0.0612838 -0.0049905 -0.0746869 0.031234 -0.007798 0.0904961 0.0059693 0.0482845 -0.080483 -0.0091085 -0.0803308 0.031927 -0.0557717 -0.0102813 -0.1163667 0.0192731 -0.0000785 0.0185111 0.076359 0.0000318 -0.0000935 0.0000396 0.1325951 0.0905933 0.0058789 -0.0482523 -0.0805187 -0.0088968 0.0802643 -0.0317642 0.0557607 -0.0104898 0.2130941 0.0919127 0.0003429 0.1003585 0.1755001 -0.0006333 0.000615 -0.0006249 0.3837324 0.2014924 0.0297265 0.0001538 0.0398834 0.1891483 -0.0005353 0.0001622 -0.0004462 0.381369 unknown
polarizability: 188.0434173|1.0619349|125.2282481|0.0298828|-0.019637|52.7894113 unknown
InChI: InChI=1S/C6H8N2OS2/c1-3-4(5(7)9)11-6(8-3)10-2/h7H2,1-2H3
charge 0 multiplicity 1
19 atoms
S  -0.167388 1.68972 -0.00237
S  -3.255059 1.155343 -0.002058
O  3.128617 -0.741894 -0.002049
N  -1.231659 -0.759459 0.00076
N  2.963314 1.57349 0.002555
C  0.1591 -0.956177 0.001158
C  0.921003 0.219065 -0.00017
C  0.687052 -2.366303 0.00285
C  -1.574109 0.518428 -0.001025
C  2.400034 0.304542 0.000078
C  -4.186633 -0.481122 -0.001152
H  -0.161843 -3.068167 0.009917
H  1.32294 -2.552422 -0.879238
H  1.33369 -2.546547 0.8782
H  -3.922798 -1.053104 -0.901096
H  -5.253176 -0.207719 -0.00163
H  -3.923276 -1.051828 0.899737
H  2.414641 2.432301 0.005764
H  3.981046 1.632852 0.002168
