program: Gaussian 09
title: 000022956
version: EM64L-G09RevD.01
frameworkgroup: C1[X(C13H20N2O2)]
method: RPBEPBE
basis: SDD
operation: Freq
keyword: #p
keyword: freq=noraman
keyword: PBEPBE/SDD
title: #p freq=noraman PBEPBE/SDD
converged: YES YES NO NO
title: Mulliken charges:
elementType: O O N N C C C C C C C C C C C C C H H H H H H H H H H H H H H H H H H H H
charge: -0.337257 -0.277835 -0.083545 -0.377165 0.198312 -0.542150 0.389952 0.358317 -0.663429 -0.562777 0.389161 -0.848908 -0.860779 -0.618591 -0.628828 0.295006 -0.607697 0.221118 0.212499 0.256560 0.305213 0.225112 0.275082 0.219772 0.241692 0.231909 0.238325 0.223867 0.187839 0.224590 0.220563 0.178117 0.253889 0.330450 0.229572 0.229911 0.272132
chargesum: 0.00000
title: Mulliken charges with hydrogens summed into heavy atoms:
elementType: O O N N C C C C C C C C C C C C C
charge: -0.337257 -0.277835 -0.083545 -0.046716 0.198312 -0.108533 0.389952 0.358317 -0.406868 -0.257564 0.389161 -0.128942 -0.148852 0.017704 0.023742 0.295006 0.123918
polarizability: 2.42268199e+02 -1.23369584e+00 1.62927301e+02 -7.64134568e+00 3.58400742e+00 1.03579318e+02
1716.lowfreq: -8.0683 0.0006 0.0007 0.0009 2.7788 10.1691 20.4791 32.3662 59.7871
frequency: 20.3147 32.3608 59.7089 70.5659 75.2159 106.7244 111.6595 149.0907 152.9538 157.9108 169.0596 213.6221 221.8061 227.6525 238.2339 252.3559 256.2877 282.8299 301.8333 333.8858 350.7621 369.2950 391.6744 450.1490 486.6624 526.5499 528.9267 540.9506 578.9384 599.5233 644.4751 677.1358 685.5295 724.5098 790.7925 813.6347 868.9695 879.6010 904.7878 916.5850 958.9717 989.3313 1011.6631 1016.6032 1034.3280 1045.4040 1052.7577 1053.7145 1089.5110 1092.6460 1126.6526 1133.3958 1135.8395 1151.2147 1169.7424 1190.1031 1203.6652 1239.5991 1252.6439 1270.8924 1299.9858 1357.3153 1376.7272 1394.7460 1399.3266 1415.8675 1426.4170 1431.5284 1438.2954 1444.2398 1458.0427 1458.5875 1463.6055 1469.4310 1471.9002 1475.4327 1482.6992 1484.3512 1485.9889 1488.1172 1499.6880 1513.4906 1589.3493 1613.8552 1684.9833 2839.2840 2851.6305 2889.7488 2965.5623 2976.9917 2979.9763 2996.0311 3013.7013 3025.2531 3047.6566 3053.1007 3057.4828 3073.2584 3086.9622 3087.7193 3088.3324 3113.4557 3151.6723 3194.7298 3579.4138
redmass: 5.5820 4.2341 2.7263 4.4171 3.5063 1.0890 3.4606 1.1395 3.2836 2.4853 1.0702 4.8091 1.2922 2.7368 3.9676 2.2656 1.3547 2.4979 2.3925 4.6993 3.1533 2.6116 2.4102 2.9494 3.3867 3.6716 3.8120 4.2539 1.1886 3.0844 5.4243 6.1170 12.1235 3.2729 3.8097 4.4717 4.4122 1.3910 1.4212 2.4889 3.5425 1.6317 2.3700 1.8667 1.5217 1.5586 1.5576 1.8983 1.4021 2.3796 1.2827 1.9149 1.5487 2.0101 2.0040 2.6577 2.1767 1.5699 2.2655 1.4888 5.7331 1.4904 4.2293 1.2731 1.2548 1.1488 2.2250 1.3791 1.1910 1.6773 1.3093 1.0569 1.1095 1.1200 1.0672 1.0620 1.2446 1.0451 1.0622 1.1088 1.1707 1.3742 7.5696 6.3607 9.1779 1.0575 1.0579 1.0682 1.0395 1.0380 1.0354 1.0881 1.0718 1.0721 1.0932 1.0969 1.1026 1.1010 1.0984 1.1002 1.1001 1.0981 1.0920 1.0926 1.0773
irintensity: 2.6664 5.9957 1.4713 1.1576 0.8285 0.1583 1.5481 0.2809 3.5735 0.2442 0.1965 1.1310 0.4265 0.1549 2.1580 0.2931 1.6467 3.3807 6.0140 21.8212 6.7412 2.5564 6.1044 0.5165 0.0429 0.4496 0.1281 2.3026 119.0601 16.7942 2.5260 4.6403 23.4674 8.8284 7.7595 20.3009 15.7014 11.9384 28.9928 4.8341 33.8412 6.1263 87.1142 12.9781 10.8021 12.5031 15.4266 2.0935 17.3796 212.0260 0.7298 331.0531 106.2599 45.4672 11.6656 244.3260 81.7088 7.3408 5.3293 13.6788 111.6085 7.0757 21.8599 21.6024 9.8974 3.1101 13.9347 17.1295 9.0497 23.3972 216.4000 38.1852 3.4510 4.8264 10.0754 16.0176 51.0837 15.6222 16.0127 35.5172 61.8101 157.8667 43.7274 60.8524 249.5912 68.4662 174.9096 118.2264 35.5286 36.3749 89.9446 28.0287 44.8314 39.5542 20.2554 17.6833 38.2501 33.4326 30.6594 25.3691 10.1283 3.7826 7.1477 3.6568 42.8700
temp: 298.150 k
press: 1.00000 atm
elementType: 8 8 7 7 6 6 6 6 6 6 6 6 6 6 6 6 6 1 1 1 1 1 1 1 1 1 1 1 1 1 1 1 1 1 1 1 1
symmnumber: 1
zpe: 813928.0 jmol-1
zpe.correction: 0.310009 hartree
zpe.thermalcorrener: 0.329217 hartree
zpe.thermalcorrenthalpy: 0.330161 hartree
zpe.thermalcorrgfe: 0.261719 hartree
zpe.sumelectzpe: -766.024156 hartree
zpe.sumelectthermal: -766.004948 hartree
zpe.sumelectthermalent: -766.004004 hartree
zpe.sumelectthermalfe: -766.072446 hartree
dipole: -0.3415 1.4596 0.2107
dipole: 1.5138
quadrupole: -75.2900 -100.6918 -104.0306
quadrupole: -11.9540 -4.3713 -0.1875
quadrupole: 18.0475 -7.3543 -10.6931 -11.9540 -4.3713 -0.1875
hfenergy: -766.3341648 hartree
pointgroup: C01 [X(C13H20N2O2)]
dipole: 0.1512989 -0.5070156 -0.2734055 debye
polarizability: 242.6097815|-1.6369805|145.3771786|3.4114976|27.3952785|120.7878584 unknown
InChI: InChI=1S/C13H20N2O2/c1-9-6-11(17-13(16)14-3)7-10(2)12(9)8-15(4)5/h6-7,14H,8H2,1-5H3
charge 0 multiplicity 1
37 atoms
O  2.60459 -0.620119 -0.308272
O  3.560311 1.239174 0.856444
N  -3.839116 -0.560129 0.510953
N  4.833239 -0.526289 -0.026038
C  -1.567582 0.195634 -0.279118
C  -3.075282 0.420037 -0.317821
C  -1.017252 -0.953148 -0.930356
C  -0.694781 1.114707 0.374523
C  0.376847 -1.170433 -0.901845
C  0.706115 0.887375 0.392466
C  1.226331 -0.255916 -0.24625
C  -1.90953 -1.938556 -1.66491
C  -1.213573 2.367134 1.07032
C  -5.290497 -0.467496 0.25739
C  -3.521401 -0.478033 1.949932
C  3.664747 0.149686 0.242116
C  6.138815 -0.01965 0.401076
H  -3.320598 1.468055 -0.020475
H  -3.435272 0.297275 -1.358646
H  0.816156 -2.045865 -1.390383
H  1.375015 1.588845 0.892413
H  -1.345632 -2.834788 -1.974605
H  -2.755607 -2.241556 -1.023104
H  -2.340335 -1.482702 -2.579049
H  -0.385998 2.907251 1.559578
H  -1.691033 3.066058 0.357533
H  -1.966446 2.129786 1.844227
H  -5.493857 -0.627117 -0.817277
H  -5.730869 0.52116 0.548591
H  -5.81817 -1.253569 0.826907
H  -4.036704 -1.293996 2.488073
H  -3.834829 0.492922 2.41462
H  -2.435454 -0.599413 2.098875
H  4.757319 -1.404708 -0.538891
H  6.804471 0.153107 -0.464702
H  6.633173 -0.720015 1.09963
H  5.977689 0.938993 0.91898
