program: Gaussian 09
title: 000268576
version: EM64L-G09RevD.01
frameworkgroup: C1[X(C11H16O3)]
method: RPBEPBE
basis: SDD
operation: Freq
keyword: #pfreq=noraman
keyword: PBEPBE/SDD
title: #p freq=noraman PBEPBE/SDD
converged: YES YES NO NO
title: Mulliken charges:
elementType: O O O C C C C C C C C C C C H H H H H H H H H H H H H H H H
charge: -0.466738 -0.344694 -0.268836 -0.611021 -0.036078 0.407738 0.204771 -0.545386 -0.688762 0.326713 -0.331913 -0.380182 -0.529180 -0.536795 0.245997 0.199784 0.202916 0.247047 0.223901 0.235795 0.191301 0.240525 0.251011 0.374081 0.229843 0.224775 0.248216 0.220402 0.245280 0.219490
chargesum: 0.00000
title: Mulliken charges with hydrogens summed into heavy atoms:
elementType: O O O C C C C C C C C C C C
charge: -0.092658 -0.344694 -0.268836 -0.165239 0.166837 0.407738 0.204771 -0.298339 -0.037765 0.326713 -0.091388 -0.129171 0.173654 0.148378
polarizability: 1.67717489e+02 -8.76683056e+00 1.39590028e+02 5.48787995e+00 1.07842895e+01 8.54570458e+01
1716.lowfreq: -9.1776 0.0005 0.0005 0.0009 9.9196 10.2483 24.9844 64.1372 78.7166
frequency: 24.3801 64.1339 78.7098 92.9872 132.1216 164.3351 184.9873 198.0259 219.8968 239.7709 250.5564 265.8874 281.3144 349.6414 371.4409 395.6452 427.4217 446.2564 451.6992 482.5157 530.6954 554.7772 577.5619 652.9463 680.5149 709.6439 754.4894 787.3709 806.2528 863.7672 884.4174 906.3538 927.3264 929.4556 988.0793 1004.5956 1019.3636 1069.7739 1109.2356 1112.9776 1116.7067 1134.7963 1149.9328 1158.6212 1180.7113 1193.0070 1212.6726 1254.3453 1262.1103 1293.9668 1330.3022 1348.3849 1378.7676 1384.1474 1412.6756 1426.0600 1441.6044 1442.7997 1451.9801 1462.0398 1467.3086 1468.7630 1472.2249 1472.5820 1477.0890 1496.3337 1597.9698 1616.0640 2955.2296 2968.4225 2975.2723 2982.8876 3000.4914 3041.0455 3046.2075 3060.4807 3071.3185 3094.5369 3122.6329 3125.6317 3148.1562 3155.2685 3176.3610 3377.1665
redmass: 4.1962 2.9997 3.4966 3.3762 3.7875 3.5573 3.1548 2.0296 1.5978 1.3797 1.4161 1.5480 3.6058 2.2885 4.8242 3.7263 4.0671 3.5926 3.0328 3.7040 1.1130 2.9162 3.7261 4.2928 4.4234 4.5836 3.2575 3.4757 1.4907 1.6225 2.0748 3.0234 1.4033 2.3363 7.7495 4.8286 1.7646 1.8236 1.9649 1.2600 1.2722 2.0415 1.5841 1.4027 1.5035 2.4106 1.3111 2.8526 1.4056 1.4819 1.3320 1.3445 1.2683 6.3275 2.6018 1.1653 1.2241 1.2083 1.1825 1.0899 1.0505 1.0529 1.1245 1.0539 1.0704 2.0522 8.1010 6.4665 1.0332 1.0322 1.0370 1.0658 1.0797 1.1038 1.1014 1.1044 1.0972 1.1002 1.0989 1.1006 1.0904 1.0874 1.0967 1.0673
irintensity: 3.2141 7.8589 0.1040 0.4114 2.0148 5.1700 3.4001 0.2768 1.8479 0.7451 2.4421 0.1973 0.3980 1.4805 2.0169 9.2258 3.6129 8.7129 11.4890 2.0024 85.0242 16.1793 0.6557 0.8050 37.8687 10.1837 2.3258 6.8132 53.1079 23.1138 1.4178 8.5457 0.5495 7.6147 24.3002 92.1072 20.2859 32.0830 45.4351 0.2244 0.4261 16.4732 3.2428 3.5159 29.0899 302.5620 1.2862 2.5922 5.5720 12.0002 8.5347 3.4271 27.3972 13.2350 29.0178 66.2856 32.2942 2.5402 12.7937 25.1280 16.4421 13.6586 96.9978 37.1728 32.0491 99.2653 3.8615 20.4843 64.4270 65.3122 22.6065 8.5112 78.7656 51.2376 14.5795 40.6992 47.2437 43.2530 27.3414 16.9125 11.2853 6.5507 7.4891 256.6710
temp: 298.150 k
press: 1.00000 atm
elementType: 8 8 8 6 6 6 6 6 6 6 6 6 6 6 1 1 1 1 1 1 1 1 1 1 1 1 1 1 1 1
symmnumber: 1
zpe: 654335.8 jmol-1
zpe.correction: 0.249223 hartree
zpe.thermalcorrener: 0.264123 hartree
zpe.thermalcorrenthalpy: 0.265067 hartree
zpe.thermalcorrgfe: 0.207173 hartree
zpe.sumelectzpe: -653.323976 hartree
zpe.sumelectthermal: -653.309076 hartree
zpe.sumelectthermalent: -653.308132 hartree
zpe.sumelectthermalfe: -653.366026 hartree
dipole: 2.2709 1.2279 -0.7549
dipole: 2.6897
quadrupole: -90.8303 -70.4159 -86.4812
quadrupole: -17.1991 -0.4371 4.2226
quadrupole: -8.2545 12.1599 -3.9054 -17.1991 -0.4371 4.2226
hfenergy: -653.5731996 hartree
pointgroup: C01 [X(C11H16O3)]
dipole: -0.8687017 -0.5444046 -0.262231 debye
polarizability: 168.5033249|-7.7704032|136.3302778|-2.7627252|-16.0747668|87.93096 unknown
InChI: InChI=1S/C11H16O3/c1-8(12)6-9-7-10(13-2)4-5-11(9)14-3/h4-5,7-8,12H,6H2,1-3H3
charge 0 multiplicity 1
30 atoms
O  3.206614 1.304527 0.127132
O  2.020587 -1.171297 -0.127921
O  -3.529852 -0.200451 0.161556
C  1.088292 1.293986 -1.225277
C  2.025776 2.090173 -0.259349
C  0.151002 0.278219 -0.581998
C  0.617391 -0.956184 -0.053661
C  -1.238866 0.542877 -0.511863
C  1.304523 2.639074 0.986341
C  -2.139921 -0.390437 0.057676
C  -0.27524 -1.897359 0.509758
C  -1.653771 -1.616042 0.566019
C  2.543616 -2.479241 0.275052
C  -4.07862 1.056739 -0.347432
H  1.742427 0.791629 -1.96453
H  0.471542 2.027496 -1.777854
H  2.4377 2.939407 -0.839335
H  -1.601342 1.492046 -0.919618
H  0.86865 1.820352 1.58649
H  2.029858 3.183095 1.615343
H  0.490191 3.335704 0.706253
H  0.087367 -2.848032 0.910892
H  -2.3611 -2.329155 0.999043
H  2.939848 0.341458 0.153698
H  2.085589 -3.287669 -0.325125
H  2.37205 -2.666059 1.352448
H  3.624298 -2.432044 0.074604
H  -3.653098 1.929474 0.186212
H  -5.160085 0.99779 -0.155356
H  -3.900029 1.165627 -1.435496
