program: Gaussian 09
title: 000268570
version: EM64L-G09RevD.01
frameworkgroup: C1[X(C10H16N4O4)]
method: RPBEPBE
basis: SDD
operation: Freq
keyword: #p
keyword: freq=noraman
keyword: PBEPBE/SDD
title: #p freq=noraman PBEPBE/SDD
converged: NO YES NO NO
title: Mulliken charges:
elementType: O O O O N N N N C C C C C C C C C C H H H H H H H H H H H H H H H H
charge: -0.448576 -0.480036 -0.488234 -0.346152 -0.189155 -0.104989 -0.649100 -0.623380 -0.173912 -0.103472 -0.481368 -0.165848 -0.118861 -0.425612 0.282987 -0.307857 -0.118656 0.190714 0.247839 0.257393 0.241936 0.237397 0.268191 0.245266 0.217063 0.257562 0.343398 0.378196 0.343252 0.366782 0.307853 0.374129 0.343029 0.322222
chargesum: 0.00000
title: Mulliken charges with hydrogens summed into heavy atoms:
elementType: O O O O N N N N C C C C C C C C C C
charge: -0.105178 -0.101840 -0.121453 -0.346152 -0.189155 -0.104989 0.032882 0.041870 0.073927 0.153921 -0.002035 0.102343 0.126405 0.049013 0.282987 0.035394 -0.118656 0.190714
polarizability: 1.86647935e+02 -1.10213205e+01 1.43587206e+02 -3.23790561e+00 -1.71252289e+01 1.13733755e+02
1716.lowfreq: -17.3847 -7.3996 -0.0008 0.0004 0.0004 6.6429 25.8812 52.8602 71.0757
frequency: 25.7665 52.8441 71.0672 94.2022 113.4362 123.2726 157.9047 171.4112 190.0346 194.9660 231.4299 246.1214 270.9561 284.0075 299.1735 310.0988 326.6929 348.2620 357.2084 397.5260 407.7724 429.8226 466.5033 513.0187 550.2224 551.9912 617.7622 636.1255 639.5379 661.0567 703.8740 706.1154 712.8437 714.1759 736.1101 766.4446 772.6395 799.9139 833.1867 874.3568 917.2852 935.7859 948.5062 968.3954 989.4825 995.0000 1013.4457 1048.4607 1056.0592 1074.8082 1095.2913 1133.7430 1136.5405 1168.8853 1172.7674 1195.0061 1197.6023 1204.4523 1220.4168 1244.3397 1265.2118 1280.8902 1284.4427 1304.7172 1313.9035 1329.9873 1344.2170 1353.1112 1376.9297 1401.1060 1412.4767 1436.8775 1445.8484 1455.7336 1477.5917 1478.9405 1538.5540 1579.0097 1613.6694 1636.0213 2979.5658 2990.1077 3010.0286 3011.9052 3026.9033 3031.4900 3052.3332 3076.2043 3203.8325 3330.9336 3384.8542 3513.9665 3569.2776 3589.5763 3650.1089 3682.6883
redmass: 5.7809 5.2031 5.2230 4.8332 5.5688 5.6107 4.1206 3.2211 4.2553 3.3976 3.1403 2.4217 3.0542 3.7392 1.5486 3.4250 3.7804 1.8231 1.3319 4.1317 3.0550 5.5595 6.1568 1.2169 3.9987 4.2419 1.1545 3.9917 3.6047 7.6698 2.0181 1.7285 1.6240 1.7127 5.0341 5.8075 5.2163 3.2890 1.2198 2.6588 3.4147 3.8370 2.8090 2.6727 4.1006 2.6169 2.5043 1.9456 2.2380 2.1509 1.6520 2.5633 1.8673 1.3542 1.3951 1.4280 1.6501 1.4092 1.3517 2.5977 1.4524 2.1290 1.4355 1.2055 1.5882 1.2886 1.3316 1.4734 1.3144 1.3971 4.8921 1.5674 3.2247 1.1045 1.4863 1.9086 2.2714 1.4989 2.0926 4.5080 1.0562 1.0824 1.0857 1.0645 1.0877 1.0947 1.1012 1.1026 1.1021 1.0659 1.0568 1.0449 1.0664 1.0666 1.0926 1.1043
irintensity: 3.8083 0.6759 3.1315 11.7964 0.2918 16.2094 35.3272 3.7387 9.7816 32.8518 56.9843 47.6170 51.0200 5.2508 56.5905 13.0063 1.5092 78.0128 104.1583 20.5536 10.7970 4.1049 11.2132 186.7759 4.0513 10.1505 64.0975 7.8920 2.0651 26.7683 42.9310 100.5197 81.2126 86.5622 1.7414 45.4342 24.6282 17.7053 58.1333 43.8759 18.6946 52.7420 18.3312 15.5748 65.2834 44.1716 13.0135 7.6422 17.1524 25.4152 9.1099 5.8435 13.9257 29.5334 8.1530 30.7244 3.3515 36.8356 5.7133 76.6231 65.2899 1.4017 25.8372 3.7380 18.0868 4.5528 11.6313 16.2055 32.4995 1.4045 35.5510 39.4433 18.6793 16.8748 45.4173 46.1592 274.4938 268.3323 97.0971 420.6340 28.2577 20.8676 27.5201 29.1651 19.8462 9.0311 48.3901 29.3625 54.3620 192.6003 129.9288 51.3318 11.3917 9.7033 39.2463 52.2149
temp: 298.150 k
press: 1.00000 atm
elementType: 8 8 8 8 7 7 7 7 6 6 6 6 6 6 6 6 6 6 1 1 1 1 1 1 1 1 1 1 1 1 1 1 1 1
symmnumber: 1
zpe: 714823.4 jmol-1
zpe.correction: 0.272262 hartree
zpe.thermalcorrener: 0.289903 hartree
zpe.thermalcorrenthalpy: 0.290847 hartree
zpe.thermalcorrgfe: 0.227079 hartree
zpe.sumelectzpe: -909.186786 hartree
zpe.sumelectthermal: -909.169145 hartree
zpe.sumelectthermalent: -909.168201 hartree
zpe.sumelectthermalfe: -909.231969 hartree
dipole: 3.0845 -0.1165 2.6872
dipole: 4.0925
quadrupole: -125.5711 -87.9046 -104.8916
quadrupole: -3.9440 10.3258 4.2078
quadrupole: -19.4487 18.2178 1.2308 -3.9440 10.3258 4.2078
hfenergy: -909.4590483 hartree
pointgroup: C01 [X(C10H16N4O4)]
dipole: 1.2971102 0.3344801 -0.8933336 debye
polarizability: 181.1234126|16.0706153|150.7292186|14.7065061|-9.910138|112.1162654 unknown
InChI: InChI=1S/C10H16N4O4/c11-9-6(10(12)18)13-3-14(9)5-1-4(2-15)7(16)8(5)17/h3-5,7-8,15-17H,1-2,11-12H2
charge 0 multiplicity 1
34 atoms
O  2.514635 2.502062 1.576637
O  2.77334 -1.058222 1.48255
O  3.692533 -2.049005 -0.823094
O  -4.230401 -0.017408 -1.239419
N  -0.252414 0.341323 0.251741
N  -1.465495 -1.530248 0.72763
N  -1.907295 1.604958 -1.088909
N  -4.163519 -2.086599 -0.133836
C  0.832558 1.342842 0.201107
C  2.86556 0.230044 -0.721816
C  1.723335 1.233512 -1.07225
C  1.861254 1.199972 1.360985
C  2.974085 0.251118 0.852405
C  2.585851 -1.169741 -1.292135
C  -1.492529 0.504643 -0.373842
C  -0.286792 -0.922549 0.90544
C  -2.235594 -0.654255 -0.069011
C  -3.60271 -0.88718 -0.522751
H  0.346616 2.336961 0.262134
H  3.820872 0.574983 -1.155566
H  2.15828 2.227702 -1.27668
H  1.138631 0.925805 -1.958781
H  1.409123 0.813732 2.293779
H  3.950467 0.669387 1.16121
H  2.585627 -1.128592 -2.398779
H  1.614797 -1.566146 -0.937012
H  1.88748 3.109271 2.044421
H  3.29426 -1.718598 0.93491
H  0.578974 -1.306064 1.443185
H  3.610509 -2.94619 -1.230787
H  -1.26828 2.300279 -1.46347
H  -2.869929 1.511899 -1.444209
H  -3.611725 -2.723857 0.441691
H  -5.117805 -2.308741 -0.407082
