program: Gaussian 09
title: 000268554
version: EM64L-G09RevD.01
frameworkgroup: C1[X(C10H10O3S)]
method: RPBEPBE
basis: SDD
operation: Freq
keyword: #p
keyword: freq=noraman
keyword: PBEPBE/SDD
title: #p freq=noraman PBEPBE/SDD
converged: YES YES NO NO
title: Mulliken charges:
elementType: S O O O C C C C C C C C C C H H H H H H H H H H
charge: -0.068160 -0.255758 -0.435348 -0.277371 0.500381 -0.381513 -0.350106 0.323050 -0.366563 -0.369519 -0.207913 -0.328824 -0.537379 0.239855 0.233667 0.249679 0.254887 0.243556 0.268512 0.226178 0.226304 0.249002 0.174330 0.389053
chargesum: 0.00000
title: Mulliken charges with hydrogens summed into heavy atoms:
elementType: S O O O C C C C C C C C C C
charge: 0.106170 -0.255758 -0.046295 -0.277371 0.500381 -0.147846 -0.100426 0.323050 -0.111675 -0.125963 0.060599 -0.328824 0.164104 0.239855
polarizability: 2.96821914e+02 -9.32384129e+00 1.42635710e+02 -3.41566981e-02 -4.95584278e-02 5.72393806e+01
1716.lowfreq: -3.5979 -1.5258 -0.0010 0.0011 0.0013 2.3386 39.0410 49.2725 84.0309
frequency: 39.0217 49.2156 84.0295 94.7202 113.7539 184.3308 184.7696 216.4092 232.7836 276.9911 310.8497 334.3784 368.6867 410.2849 413.2789 461.5219 463.8366 531.9031 532.4030 563.9540 601.6712 615.3534 669.1049 702.5040 740.2633 750.1392 808.0929 832.6586 834.6735 861.1176 924.4274 944.2815 960.7527 970.9035 982.0719 998.8258 1100.9726 1112.0654 1126.6642 1157.3407 1186.0606 1236.9579 1249.2045 1309.7196 1324.9154 1333.7667 1393.3572 1433.7609 1438.2802 1468.2938 1470.4335 1499.7220 1564.1860 1589.0262 1600.4377 1625.6296 2358.2813 2967.2102 3058.2457 3118.7352 3128.4525 3131.5208 3154.8468 3170.6998 3178.2788 3539.2899
redmass: 4.4645 5.3213 10.0104 6.5011 3.9100 3.0604 4.1148 8.0839 1.3716 4.3232 6.9775 3.9690 1.1848 2.8893 9.5524 4.7120 2.8946 5.7289 1.9255 1.3567 4.5634 6.5458 5.8048 6.3030 3.6207 5.5204 1.3121 1.5599 2.4832 1.7736 1.3956 1.4474 5.3991 1.4068 8.8565 2.6283 1.8593 1.2592 1.3942 1.3293 1.3412 2.1768 3.3257 1.4340 2.9816 1.8989 2.2948 3.3990 1.2440 1.0494 1.0795 2.4247 6.5385 7.4216 6.8822 6.4075 1.0370 1.0327 1.1043 1.0877 1.0896 1.0999 1.0880 1.0952 1.0953 1.0643
irintensity: 2.0510 0.1915 0.1425 1.6200 4.4585 2.3764 1.0259 5.2927 0.8627 5.0582 7.1831 2.6021 27.5558 0.2811 18.1935 1.2459 18.7790 48.7248 113.6802 58.7244 12.2634 15.3515 21.4294 35.1967 0.0152 8.5608 10.8929 63.7156 27.2124 12.4269 23.2462 2.9018 203.5130 2.1104 51.8057 7.8181 469.2774 0.1929 74.3547 3.7565 144.3300 14.0679 228.3474 3.8751 74.6487 8.7798 117.0226 1.5762 13.7640 14.6120 77.4948 92.0930 3.0906 794.6210 120.1062 16.4523 31.0748 74.8284 43.3762 1.7955 8.7979 24.9173 9.8578 9.8641 4.1897 78.4851
temp: 298.150 k
press: 1.00000 atm
elementType: 16 8 8 8 6 6 6 6 6 6 6 6 6 6 1 1 1 1 1 1 1 1 1 1
symmnumber: 1
zpe: 461102.5 jmol-1
zpe.correction: 0.175625 hartree
zpe.thermalcorrener: 0.189340 hartree
zpe.thermalcorrenthalpy: 0.190285 hartree
zpe.thermalcorrgfe: 0.134278 hartree
zpe.sumelectzpe: -1009.753595 hartree
zpe.sumelectthermal: -1009.739879 hartree
zpe.sumelectthermalent: -1009.738935 hartree
zpe.sumelectthermalfe: -1009.794942 hartree
dipole: -2.8702 0.2843 0.0081
dipole: 2.8843
quadrupole: -77.8908 -80.1372 -93.8260
quadrupole: 16.2165 -0.0092 -0.0397
quadrupole: 6.0605 3.8142 -9.8747 16.2165 -0.0092 -0.0397
hfenergy: -1009.9292194 hartree
pointgroup: C01 [X(C10H10O3S1)]
dipole: 1.1212535 -0.1591993 -0.0714728 debye
dipolederiv: 0.077574 -0.0990217 -0.0442051 0.4116612 -0.4163123 -0.1108278 0.1878175 -0.1106019 -0.2249309 -2.2922042 -0.1984773 -0.0873444 -0.2210945 -0.3506099 -0.0252999 -0.0961193 -0.025211 -0.306238 -0.5384684 -0.2550876 -0.1154483 -0.819958 -0.9846435 -0.2596364 -0.3726938 -0.2605252 -0.5289318 -1.5081699 0.2703449 0.1241167 0.2391926 -0.6813616 -0.1567004 0.1093781 -0.1564415 -0.408657 -0.7118821 -0.1156479 -0.0515985 -0.1305997 -0.105986 -0.0572579 -0.0570821 -0.0573646 -0.0093331 0.4207565 0.0167396 0.0060493 -0.2038603 0.079602 0.1094443 -0.095191 0.109165 -0.1039596 0.4387522 0.0555425 0.0241633 0.1847109 0.0357881 0.076301 0.0823025 0.0763089 -0.0920956 1.9868108 0.105184 0.0434581 -0.1983767 0.1318501 0.009595 -0.0996526 0.0090855 0.1160136 -0.5564472 -0.0717469 -0.0325656 -0.4547232 -0.0129087 0.074714 -0.2104292 0.0742445 -0.1360968 -0.7027388 0.0407619 0.0197011 0.5190741 -0.0780015 0.0534528 0.2438059 0.0541405 -0.1693733 1.2146116 0.0040988 -0.000101 -0.1207969 -0.1879289 -0.053865 -0.0580413 -0.0533099 -0.0938209 -1.813331 -0.0473736 -0.0195139 -0.2961784 0.5561753 0.3206705 -0.1323431 0.3202286 0.0004388 0.7354769 0.129646 0.0592445 0.6391784 0.3859191 0.0289586 0.2956701 0.0300941 0.3332619 2.7110286 -0.0754146 -0.0371308 0.6234145 1.0263604 0.3508652 0.2842781 0.351696 0.410804 0.040133 -0.1037107 -0.0477825 -0.0528968 -0.0063429 -0.0725263 -0.0244523 -0.0724106 0.1160977 0.0793008 0.0577921 0.0274013 0.05354 0.0191532 -0.0640295 0.0258356 -0.0641343 0.1263818 0.0315434 0.0740869 0.0349008 0.0768854 0.0235555 -0.0692747 0.036303 -0.0693269 0.1395135 0.0096584 -0.0651951 -0.0300999 -0.1001762 0.0049619 -0.0744559 -0.0458605 -0.0746332 0.1302867 0.087908 0.0479262 0.0221134 -0.0483345 0.0136544 -0.0659756 -0.0237809 -0.066472 0.1271243 0.0657404 -0.0020402 0.0817695 -0.1502317 0.0309727 -0.0407022 -0.0777005 -0.0502965 -0.1486012 0.0653055 0.0619395 -0.0547642 -0.1556879 -0.1187205 0.0766079 -0.0652885 0.0852166 0.0017319 -0.1715415 0.0152162 0.0079462 0.0508703 0.0879666 -0.0176322 0.02467 -0.0175374 0.1174692 0.1359917 0.1330661 0.0600765 -0.0064757 0.2029108 -0.005578 -0.0040415 -0.005174 0.2125713 0.1941912 0.0213709 0.0096135 0.1608633 0.3439456 -0.0268473 0.0726158 -0.0267408 0.3903435 unknown
polarizability: 295.3079983|-16.0729976|128.9396761|-7.7304018|33.0231447|72.4493297 unknown
InChI: InChI=1S/C10H10O3S/c1-13-8-4-2-7(3-5-8)6-9(14)10(11)12/h2-6,11,14H,1H3
charge 0 multiplicity 1
24 atoms
S  -2.183149 2.023569 1.044416
O  4.317366 -0.371975 -0.066577
O  -3.994713 -1.287846 -0.463768
O  -4.81793 0.684602 0.433639
C  0.06379 -0.345707 -0.039865
C  0.837458 -1.439819 -0.551232
C  0.780816 0.773792 0.480379
C  2.923328 -0.294943 -0.025551
C  2.236066 -1.422886 -0.548122
C  2.18853 0.804178 0.489792
C  -1.386017 -0.475011 -0.097211
C  -2.404239 0.372208 0.291095
C  5.083224 0.76462 0.458541
C  -3.819661 -0.020909 0.112461
H  0.314386 -2.314268 -0.956714
H  0.24328 1.634579 0.88546
H  2.821547 -2.2597 -0.939834
H  2.700132 1.681004 0.897474
H  -1.743806 -1.41906 -0.529765
H  4.872025 0.927012 1.532771
H  4.866664 1.689502 -0.109551
H  6.1378 0.484076 0.324783
H  -3.556602 2.23693 1.138717
H  -4.970893 -1.458746 -0.541543
