program: Gaussian 09
title: 000268559
version: EM64L-G09RevD.01
frameworkgroup: C1[X(C16H16OS)]
method: RPBEPBE
basis: SDD
operation: Freq
keyword: #p
keyword: freq=noraman
keyword: PBEPBE/SDD
title: #p freq=noraman PBEPBE/SDD
converged: YES YES NO NO
title: Mulliken charges:
elementType: S O C C C C C C C C C C C C C C C C H H H H H H H H H H H H H H H H
charge: 0.154277 -0.215673 -0.391726 -0.578996 -0.395621 -0.391964 -0.501981 0.268254 -0.166433 -0.455354 0.374883 -0.197676 0.387338 -0.440446 -0.414332 -0.406256 -0.240079 -0.242254 0.237390 0.214296 0.331707 0.213580 0.219976 0.217963 0.208131 0.241463 0.246571 0.254096 0.293712 0.240868 0.238465 0.239598 0.228033 0.228192
chargesum: 0.00000
title: Mulliken charges with hydrogens summed into heavy atoms:
elementType: S O C C C C C C C C C C C C C C C C
charge: 0.154277 -0.215673 0.059960 -0.247289 0.037935 0.034130 -0.013948 0.268254 -0.166433 -0.201258 0.374883 0.096036 0.387338 -0.199579 -0.175867 -0.166658 -0.012046 -0.014062
polarizability: 3.25036622e+02 1.75761221e+00 1.79239318e+02 -2.78218994e+00 9.31255999e+00 1.05630950e+02
1716.lowfreq: -18.7499 -0.2766 -0.0018 -0.0009 0.0018 9.0511 26.3474 50.1363 58.7607
frequency: 20.1219 49.4217 58.6898 85.5221 113.8963 125.8392 147.4129 186.7923 213.8246 236.5022 272.9013 330.8221 356.8499 388.1445 394.5441 414.9228 440.6694 461.2045 475.7773 502.0163 512.5700 516.3425 588.5705 632.0805 640.2781 650.9927 674.8417 737.8492 754.6155 758.5640 778.6846 816.2085 830.7964 835.4831 843.7672 869.2250 892.9444 906.3306 918.9924 928.5233 961.2448 972.4669 985.4194 991.6091 1022.1218 1041.8146 1056.6661 1067.6446 1091.7555 1116.1375 1124.4946 1131.9703 1170.9746 1174.3981 1195.5926 1224.1930 1226.8799 1242.2227 1249.3551 1256.1562 1274.5600 1284.7707 1303.1863 1339.2133 1340.3875 1345.3578 1348.9711 1402.3685 1421.2372 1430.1591 1437.4126 1449.5651 1452.8752 1471.5755 1475.6681 1507.3358 1576.2190 1589.2884 1613.2294 1632.6810 2968.2422 2977.6604 2982.5784 2983.0660 3042.9745 3047.8052 3054.2732 3072.7085 3075.2737 3120.3810 3125.2314 3126.7011 3132.6501 3142.9428 3149.4391 3162.2606
redmass: 5.2386 4.7045 5.2427 4.6717 4.6349 5.3323 3.8441 3.7578 4.0315 3.5574 4.8919 2.1583 4.6987 3.7129 3.2173 4.2593 3.6060 3.4733 2.5146 3.3354 6.1640 3.8562 7.4872 6.8149 3.4808 3.2173 3.1070 3.3142 1.2621 4.7696 2.6524 1.5906 5.5781 1.3530 2.3659 1.4450 1.7968 1.7120 1.8857 4.9334 1.3717 2.8413 1.3371 1.3517 2.3276 1.7162 1.6795 2.4185 1.3584 1.3009 2.3605 1.6590 1.1572 1.1847 1.2873 1.8389 1.5730 1.3809 1.4855 1.6610 1.7361 1.4135 1.4028 1.4383 1.5285 1.6758 1.5648 4.9704 2.9466 4.4157 1.0838 1.0874 2.1142 1.0816 1.0915 3.4264 7.2695 5.5493 9.3279 6.7252 1.0660 1.0659 1.0641 1.0591 1.0976 1.0979 1.1013 1.0875 1.0963 1.0856 1.0891 1.0884 1.0914 1.0950 1.0977 1.1004
irintensity: 0.8976 1.5539 2.9396 0.9949 3.0952 0.3838 1.1956 1.7311 0.8488 2.4586 0.1141 1.0402 0.8051 3.6652 0.5990 0.2177 9.8621 3.5415 23.2260 10.8780 0.0455 0.7596 13.7705 0.6727 2.1798 3.9308 3.3243 1.5718 44.8009 0.8375 1.2102 23.2217 17.9081 37.9552 3.0552 48.3925 1.0651 6.2846 29.9471 11.4102 6.0094 4.2510 1.8376 0.4388 3.4796 2.3877 15.6265 14.3526 7.3610 21.9470 4.2602 13.9406 0.1244 0.3557 1.4977 40.6911 13.2330 1.1617 0.5283 33.6317 6.9578 5.6947 19.7397 7.7515 1.9183 4.7169 5.3239 5.5463 0.5790 1.7644 20.7564 13.1399 16.1190 15.3585 13.7033 36.0361 1.0721 33.1332 126.2171 22.7107 23.8747 3.8207 29.4489 41.9981 62.7906 37.3059 32.8989 8.2097 23.7224 2.8685 2.3130 8.9956 3.5685 33.3615 12.4148 41.5418
temp: 298.150 k
press: 1.00000 atm
elementType: 16 8 6 6 6 6 6 6 6 6 6 6 6 6 6 6 6 6 1 1 1 1 1 1 1 1 1 1 1 1 1 1 1 1
symmnumber: 1
zpe: 720911.0 jmol-1
zpe.correction: 0.274580 hartree
zpe.thermalcorrener: 0.290202 hartree
zpe.thermalcorrenthalpy: 0.291146 hartree
zpe.thermalcorrgfe: 0.230358 hartree
zpe.sumelectzpe: -1091.311673 hartree
zpe.sumelectthermal: -1091.296051 hartree
zpe.sumelectthermalent: -1091.295107 hartree
zpe.sumelectthermalfe: -1091.355895 hartree
dipole: 1.1532 -2.0531 0.8957
dipole: 2.5194
quadrupole: -90.3655 -114.1006 -116.0234
quadrupole: -6.2050 0.5586 1.1994
quadrupole: 16.4643 -7.2708 -9.1936 -6.2050 0.5586 1.1994
hfenergy: -1091.5862535 hartree
pointgroup: C01 [X(C16H16O1S1)]
dipole: -0.5428035 -0.7921867 0.2456176 debye
polarizability: 322.7106067|-15.6729315|137.9408565|10.1496813|-38.6279167|149.2554265 unknown
InChI: InChI=1S/C16H16OS/c17-15-7-3-4-8-16(15)18-14-10-9-12-5-1-2-6-13(12)11-14/h1-2,5-6,9-11,16H,3-4,7-8H2
charge 0 multiplicity 1
34 atoms
S  -1.544683 -0.234806 0.947736
O  -2.471063 1.974584 -1.774247
C  -3.638356 -1.275732 -0.672917
C  -2.505117 -0.228534 -0.730238
C  -4.777639 -0.859827 0.285327
C  -5.342683 0.526615 -0.100565
C  -4.229228 1.611118 -0.110013
C  -3.025277 1.196395 -0.948089
C  0.201733 -0.04328 0.384982
C  1.186869 -0.729719 1.101391
C  2.571973 -0.573133 0.767203
C  0.55527 0.820218 -0.703362
C  2.938467 0.287708 -0.339803
C  1.897546 0.965831 -1.056689
C  3.607696 -1.256172 1.488435
C  4.323378 0.433839 -0.680091
C  4.948997 -1.093984 1.133687
C  5.310993 -0.242212 0.040741
H  -3.212812 -2.254775 -0.387021
H  -4.049063 -1.383627 -1.698972
H  -1.756102 -0.476522 -1.499673
H  -4.398413 -0.834034 1.326785
H  -5.581358 -1.619218 0.25689
H  -6.140133 0.83074 0.602683
H  -5.805313 0.467983 -1.106186
H  -3.869651 1.763773 0.92871
H  -4.599556 2.581442 -0.482543
H  0.908532 -1.402066 1.921256
H  -0.218918 1.369428 -1.249556
H  2.167447 1.624101 -1.89111
H  3.331105 -1.907894 2.325874
H  4.597442 1.086563 -1.517683
H  5.732413 -1.618127 1.692184
H  6.366906 -0.124373 -0.226128
