program: Gaussian 09
title: 000268544
version: EM64L-G09RevD.01
frameworkgroup: C1[X(C10H12O2S)]
method: RPBEPBE
basis: SDD
operation: Freq
keyword: #p
keyword: freq=noraman
keyword: PBEPBE/SDD
title: #p freq=noraman PBEPBE/SDD
converged: YES YES NO NO
title: Mulliken charges:
elementType: S O O C C C C C C C C C C H H H H H H H H H H H H
charge: 0.184160 -0.413129 -0.238155 -0.368197 0.464184 -0.676189 -0.411309 -0.230083 -0.370537 -0.810783 -0.236437 -0.226717 0.194852 0.281789 0.268912 0.262736 0.277410 0.257987 0.234129 0.252283 0.235113 0.227757 0.232729 0.229733 0.377761
chargesum: 0.00000
title: Mulliken charges with hydrogens summed into heavy atoms:
elementType: S O O C C C C C C C C C C
charge: 0.184160 -0.035368 -0.238155 -0.368197 0.464184 -0.125488 0.128837 0.027904 -0.136408 -0.095629 -0.003708 0.003016 0.194852
polarizability: 1.42118939e+02 -2.07026950e+01 1.25593002e+02 -1.15037163e+01 -9.99396586e+00 1.14329034e+02
1716.lowfreq: -19.7931 -10.3400 -0.0016 0.0003 0.0019 3.0687 18.5555 25.9098 32.7243
frequency: 18.4491 25.2373 32.5610 70.5293 117.3937 144.1733 148.1403 181.8567 231.7634 255.8440 308.5323 348.5342 419.5833 426.8855 449.6848 505.9176 519.7567 540.5967 566.9243 642.2237 657.5454 690.0463 718.8964 755.8253 768.2503 794.7362 864.3884 875.9918 954.0509 981.2076 985.9273 991.4807 1028.8924 1033.4911 1042.8081 1046.6740 1083.3724 1127.7290 1146.2528 1172.5429 1210.4447 1227.4228 1262.9012 1271.9311 1274.9516 1352.2196 1362.2168 1395.5874 1418.4389 1438.0932 1446.9970 1457.8657 1469.5044 1480.8653 1574.0739 1598.2851 1661.8887 2973.4832 2995.9739 3046.7174 3054.6566 3063.0384 3090.2195 3120.3589 3122.3819 3134.4967 3148.2010 3165.3219 3509.3470
redmass: 11.5247 4.2562 5.6867 2.1961 2.7860 1.6137 2.4390 2.6631 4.1533 4.7275 6.2218 4.6786 4.3838 4.0602 3.0056 1.9079 3.3715 5.4019 5.0495 1.3307 6.2284 5.0081 3.1290 1.2608 1.4090 4.7195 4.3368 1.2994 1.3673 1.5837 1.7837 1.3294 4.8174 3.2396 2.2419 1.5572 2.3545 1.5432 1.1934 1.0586 2.3014 1.2747 1.2699 1.3906 1.4270 1.9596 8.3589 1.2269 2.0471 1.0850 1.1127 1.8706 1.2027 1.1062 5.7413 6.3687 8.2453 1.0395 1.0647 1.0589 1.0935 1.0955 1.1000 1.0867 1.1055 1.0887 1.0942 1.1008 1.0639
irintensity: 1.2866 0.2141 0.0313 0.5332 0.2198 1.0334 3.0343 0.5309 2.2078 0.8590 5.5987 0.8485 12.5846 9.3779 11.4845 25.3331 2.4292 0.8576 37.4175 123.9701 6.7980 8.2578 6.4250 48.5683 52.6312 0.6811 1.2046 0.4008 0.9877 1.8925 10.1834 0.0825 22.3559 186.7390 9.5219 14.8108 73.5637 4.4476 2.8985 0.4369 1.3408 6.2455 7.6915 5.1207 0.3570 96.1349 0.3556 17.1763 4.4388 17.1043 18.6365 27.4550 19.4691 22.1922 1.1200 2.1632 207.1862 21.5143 12.1754 13.0228 22.6796 1.7979 10.1536 6.1091 7.0399 8.1990 22.1018 23.7757 20.0382
temp: 298.150 k
press: 1.00000 atm
elementType: 16 8 8 6 6 6 6 6 6 6 6 6 6 1 1 1 1 1 1 1 1 1 1 1 1
symmnumber: 1
zpe: 514409.7 jmol-1
zpe.correction: 0.195928 hartree
zpe.thermalcorrener: 0.209603 hartree
zpe.thermalcorrenthalpy: 0.210547 hartree
zpe.thermalcorrgfe: 0.152500 hartree
zpe.sumelectzpe: -935.812625 hartree
zpe.sumelectthermal: -935.798951 hartree
zpe.sumelectthermalent: -935.798007 hartree
zpe.sumelectthermalfe: -935.856053 hartree
dipole: -0.2881 1.6751 0.7790
dipole: 1.8697
quadrupole: -79.0810 -82.3340 -85.1227
quadrupole: 1.3626 -6.3088 -0.7109
quadrupole: 3.0982 -0.1548 -2.9435 1.3626 -6.3088 -0.7109
hfenergy: -936.0085536 hartree
pointgroup: C01 [X(C10H12O2S1)]
dipole: -0.0784379 0.6798734 0.2696571 debye
dipolederiv: -0.2255625 -0.0100565 0.0137493 0.0634489 -0.1801797 0.0698237 -0.0039813 0.0689193 -0.0006735 -0.8221685 -0.4394641 0.1360422 -0.5268483 -0.932541 0.047825 0.074966 0.0112797 -0.3162849 -0.6114409 0.0307101 -0.2222977 -0.182504 -0.6825419 0.1711992 -0.1435789 0.3490642 -0.6558689 0.2038615 -0.2608294 -0.1879744 -0.2829008 0.0799305 0.0778262 -0.2455158 0.0969421 -0.0817546 -0.065195 -0.0486681 0.1109896 0.1152703 0.1409191 -0.2185972 0.0696362 -0.1841283 0.0303639 0.3247178 0.0613987 0.125477 0.0232665 0.0853449 -0.0139521 0.1749319 -0.0501427 0.0551381 -0.2926259 -0.0499908 -0.2046389 0.1366497 -0.0286613 0.106341 -0.3718826 0.0294452 -0.1042932 -0.183654 0.0744774 -0.058679 -0.0115748 -0.0922328 -0.0097133 0.0151722 -0.0813966 -0.0093226 -0.096195 0.0442442 -0.1465307 -0.0408817 -0.1562185 0.0487504 -0.0866496 -0.0564197 0.0274227 0.0534588 0.0663063 -0.0328146 0.046165 -0.1040763 0.0516781 0.0104519 0.1238085 -0.0568717 -0.1355122 -0.0515252 0.0009042 -0.0354756 0.0302078 -0.1070524 -0.0294696 -0.0597858 -0.0628882 -0.0386784 -0.0929741 -0.0950419 -0.0767376 0.0178092 -0.0016875 -0.0811186 0.0034478 -0.0127547 1.1479572 0.4206525 0.3243087 0.5711084 1.1774955 -0.3535302 0.3732935 -0.4235114 0.7788841 0.0470252 -0.0361452 0.0001552 -0.0528026 0.0609155 -0.0000198 0.0008428 0.0437008 -0.0822814 -0.0572517 0.103007 0.0241658 0.0316516 -0.0092222 -0.0430344 0.0025185 -0.0343217 0.0807954 0.0687753 -0.031903 0.0342967 -0.0587634 0.0771608 0.0047435 0.073524 0.0394971 -0.0189208 0.1208562 0.0652716 0.0066881 0.0334205 -0.0024675 -0.0480583 0.0331496 -0.0319887 0.0666763 0.0923498 -0.0141958 0.1021746 -0.0030912 0.0940119 0.019513 0.0928586 0.0391948 -0.0024376 0.056795 0.0150063 0.1063312 -0.0025075 0.075657 0.061193 0.1241166 0.0406541 -0.0474961 0.1204692 0.0568312 0.0098689 0.0421986 -0.0170854 -0.0348487 -0.0152646 -0.1146631 0.0403875 -0.0253154 0.0143853 -0.1392656 -0.028963 0.0397062 0.0165927 -0.114478 0.0307856 0.0122339 -0.0797997 -0.0835091 0.1302699 0.0077517 0.0650904 0.0221052 0.1038143 0.059093 0.0362796 0.111493 0.0559894 0.016608 0.0787615 -0.063125 0.0981029 0.0136011 0.1011682 0.0542282 0.0315451 0.1169685 0.0741177 0.1215896 -0.0033465 -0.0351684 0.0851644 -0.0437534 0.0765399 0.2540953 -0.0059874 -0.1289041 0.0317682 0.3274492 0.0699685 -0.1561026 0.043111 0.1928989 unknown
polarizability: 140.1253561|-21.5083708|128.3894903|-9.2646864|-11.4041327|113.5261287 unknown
InChI: InChI=1S/C10H12O2S/c1-8-4-2-3-5-9(8)13-7-6-10(11)12/h2-5,11H,6-7H2,1H3
charge 0 multiplicity 1
25 atoms
S  -0.091945 -1.556449 -1.600577
O  3.975299 1.164757 0.316964
O  3.462001 -0.779045 1.479287
C  -1.236039 -0.341492 -0.795727
C  -1.915067 -0.638555 0.422676
C  1.395617 -1.46949 -0.423201
C  2.08278 -0.098239 -0.467821
C  -1.468428 0.878777 -1.47707
C  -2.813399 0.33875 0.929435
C  -1.714992 -1.939849 1.176974
C  -2.373751 1.830139 -0.957147
C  -3.044183 1.558504 0.256836
C  3.208704 0.01126 0.543235
H  1.059841 -1.717932 0.594723
H  2.06645 -2.273644 -0.768619
H  2.480931 0.121229 -1.47455
H  1.351827 0.705071 -0.247512
H  -0.937487 1.072037 -2.414942
H  -3.345829 0.126556 1.864669
H  -1.463111 -2.764338 0.487623
H  -0.888852 -1.859409 1.910561
H  -2.623891 -2.211426 1.741233
H  -2.548536 2.76954 -1.492641
H  -3.74799 2.28772 0.673473
H  4.69135 1.222628 1.007017
