program: Gaussian 09
title: 000268551
version: EM64L-G09RevD.01
frameworkgroup: C1[X(C12H15NO3S)]
method: RPBEPBE
basis: SDD
operation: Freq
keyword: #p
keyword: freq=noraman
keyword: PBEPBE/SDD
title: #p freq=noraman PBEPBE/SDD
converged: YES YES NO NO
title: Mulliken charges:
elementType: S O O O N C C C C C C C C C C C C H H H H H H H H H H H H H H H
charge: 0.231367 -0.416575 -0.247875 -0.277281 -0.426206 -0.207115 0.121730 -0.356631 0.333514 -0.345157 -0.374774 0.235830 -0.242687 -0.159412 -0.219192 -0.772643 -0.859848 0.261181 0.248440 0.238504 0.345285 0.242771 0.276926 0.248018 0.244823 0.342933 0.252322 0.219919 0.253405 0.271112 0.270085 0.267232
chargesum: 0.00000
title: Mulliken charges with hydrogens summed into heavy atoms:
elementType: S O O O N C C C C C C C C C C C C
charge: 0.231367 -0.073642 -0.247875 -0.277281 -0.080921 0.054066 0.121730 0.130313 0.333514 -0.102386 -0.097849 0.235830 0.005331 0.085411 -0.219192 -0.046997 -0.051418
polarizability: 2.93447701e+02 -9.16232862e+00 1.53774830e+02 5.59317111e+00 2.60877642e+00 9.26956976e+01
1716.lowfreq: -2.3725 -0.0018 -0.0012 -0.0004 7.5752 12.3444 26.6899 44.1380 59.2625
frequency: 26.6692 44.1367 59.2518 61.0330 62.7741 77.0477 93.2594 99.6845 112.1590 150.5835 178.0586 206.6701 220.1161 234.2968 263.0786 280.3902 317.2467 337.7158 374.5809 401.1826 408.1110 460.9778 481.0862 506.0925 538.4523 594.6476 625.1975 628.8815 662.8383 675.7715 716.4843 731.7008 742.2946 792.8550 831.7233 843.4770 863.4464 945.0138 963.2353 968.6594 969.6180 978.9019 989.0784 990.8010 1002.6111 1007.5214 1030.5075 1042.8136 1077.0086 1127.7394 1130.2508 1176.6092 1196.5476 1208.1526 1242.9808 1266.9332 1302.8756 1333.4316 1341.8818 1351.8069 1362.7234 1373.7730 1387.5505 1419.5704 1450.3123 1454.9152 1455.4990 1461.1291 1471.2513 1473.3466 1485.0955 1541.7237 1573.6456 1604.8999 1609.8552 2995.2298 2998.0290 3006.6624 3011.6965 3098.3636 3100.6071 3102.8372 3131.2093 3134.9096 3139.0262 3149.8843 3156.1268 3170.2164 3456.6813 3545.0343
redmass: 4.4535 3.9580 1.3116 5.5766 3.4030 4.2225 4.4184 5.2076 4.7702 4.6363 3.5699 1.6999 1.8096 5.4015 4.2537 3.5959 5.2244 3.8437 1.6085 2.7362 2.8967 4.4990 3.4599 5.7813 4.0180 3.5648 5.8078 4.4669 5.7999 6.2998 4.6326 1.1603 4.1840 3.2971 1.5228 1.5138 3.1225 2.5222 1.3891 3.9673 1.2405 1.8718 1.4218 1.3508 3.2925 2.5819 1.7850 1.6580 3.4643 1.6361 1.9287 1.3086 1.3723 1.3156 1.5703 2.3544 1.3075 1.3023 1.8563 1.2098 2.4804 1.4017 1.2355 4.2284 1.0575 1.5190 1.0581 1.0756 1.1119 1.4222 2.2331 7.5446 7.9621 6.2000 6.5166 1.0688 1.0358 1.0783 1.0291 1.0978 1.0996 1.1013 1.1064 1.0874 1.1021 1.0877 1.0965 1.0959 1.0775 1.0654
irintensity: 1.0127 1.4767 0.1841 2.9846 2.6489 4.1241 7.2171 1.0100 0.4645 16.9988 7.7054 2.4564 4.7858 5.4889 3.5715 12.2755 1.8349 18.3026 139.8710 31.4579 2.5770 4.4686 28.0151 49.0103 10.5927 10.1129 3.1374 6.7453 1.5539 2.4180 1.9393 66.6133 9.0747 3.7894 25.0811 21.7932 35.9665 101.1582 13.6777 15.5382 4.6927 10.2115 5.5289 6.6782 85.5208 3.6808 27.8394 15.0376 112.8400 15.6438 3.8407 74.7953 23.6503 8.9744 26.8528 135.0751 3.5744 25.6511 66.2845 44.7346 60.8053 80.3019 80.9556 20.8255 29.8169 370.0870 17.4019 23.1291 21.7797 167.1038 27.9098 115.8681 156.5669 243.3324 62.4207 30.3745 9.4221 22.6705 21.7826 7.7413 27.7829 19.5470 14.5983 5.7609 5.6265 0.3772 11.0264 6.5774 120.3450 5.2709
temp: 298.150 k
press: 1.00000 atm
elementType: 16 8 8 8 7 6 6 6 6 6 6 6 6 6 6 6 6 1 1 1 1 1 1 1 1 1 1 1 1 1 1 1
symmnumber: 1
zpe: 655976.8 jmol-1
zpe.correction: 0.249848 hartree
zpe.thermalcorrener: 0.268179 hartree
zpe.thermalcorrenthalpy: 0.269124 hartree
zpe.thermalcorrgfe: 0.201458 hartree
zpe.sumelectzpe: -1143.495075 hartree
zpe.sumelectthermal: -1143.476744 hartree
zpe.sumelectthermalent: -1143.475799 hartree
zpe.sumelectthermalfe: -1143.543465 hartree
dipole: 3.4253 1.9675 -1.0562
dipole: 4.0890
quadrupole: -84.9928 -111.1430 -116.9262
quadrupole: -4.1471 1.3458 -1.5203
quadrupole: 19.3612 -6.7890 -12.5722 -4.1471 1.3458 -1.5203
hfenergy: -1143.744923 hartree
pointgroup: C01 [X(C12H15N1O3S1)]
dipole: 1.3676732 0.4295378 0.730036 debye
polarizability: 292.3324217|2.7735858|93.046202|-15.848717|-6.2745493|154.539605 unknown
InChI: InChI=1S/C12H15NO3S/c1-8(15)13-11(7-14)12(16)9-3-5-10(17-2)6-4-9/h3-6,11,13-14H,7H2,1-2H3
charge 0 multiplicity 1
32 atoms
S  5.109502 0.674542 -1.217273
O  -1.971934 -2.35475 0.06479
O  -0.995162 0.330056 1.964186
O  -4.337795 0.741304 -1.513065
N  -3.127483 0.342648 0.425543
C  -1.865855 0.121104 -0.289603
C  -0.717519 0.289002 0.723184
C  -1.847986 -1.301718 -0.939336
C  0.682274 0.371915 0.235106
C  1.02125 0.573313 -1.134068
C  1.736165 0.266471 1.18322
C  -4.289411 0.690689 -0.243647
C  2.363668 0.663539 -1.536222
C  3.081925 0.348022 0.788701
C  3.408169 0.54775 -0.577971
C  -5.495057 0.998681 0.637402
C  6.155059 0.4657 0.327922
H  -1.784095 0.855516 -1.115045
H  -2.670076 -1.337849 -1.680732
H  -0.886783 -1.491199 -1.441751
H  -3.03506 0.4150 1.447095
H  0.240623 0.681409 -1.894471
H  1.470653 0.115672 2.234758
H  2.606919 0.827109 -2.591721
H  3.866079 0.254345 1.545484
H  -2.807665 -2.19378 0.574125
H  -6.327568 0.329113 0.360652
H  -5.288482 0.888331 1.715613
H  -5.829944 2.031774 0.440377
H  5.980285 -0.520376 0.784827
H  5.955804 1.275863 1.046048
H  7.197297 0.530401 -0.019727
