program: Gaussian 09
title: 000022855
version: EM64L-G09RevD.01
frameworkgroup: C1[X(C6H14N2O2S)]
method: RPBEPBE
basis: SDD
operation: Freq
keyword: #p
keyword: freq=noraman
keyword: PBEPBE/SDD
title: #p freq=noraman PBEPBE/SDD
converged: YES YES NO NO
title: Mulliken charges:
elementType: S O O N N C C C C C C H H H H H H H H H H H H H H
charge: 0.119555 -0.428582 -0.233885 -0.605216 -0.583824 -0.391643 -0.104620 -0.672273 -0.631420 0.174918 -0.347113 0.217244 0.227274 0.256007 0.262595 0.270926 0.278716 0.271069 0.217220 0.204519 0.297028 0.272682 0.268257 0.280847 0.379722
chargesum: 0.00000
title: Mulliken charges with hydrogens summed into heavy atoms:
elementType: S O O N N C C C C C C
charge: 0.119555 -0.048861 -0.233885 -0.035506 -0.034720 0.052875 0.151387 -0.138753 -0.081635 0.174918 0.074625
polarizability: 1.27388286e+02 -7.77445713e+00 1.00426314e+02 -2.24371254e+00 -5.13406909e+00 8.21092061e+01
1716.lowfreq: -20.4158 -4.2775 -3.6414 -0.0007 0.0015 0.0024 11.3691 32.6117 44.1719
frequency: -15.0976 32.5330 44.0026 64.6538 92.9516 107.1559 142.0918 189.1145 197.6887 228.2672 264.8684 276.7711 296.3272 312.3710 363.0491 405.8286 490.8643 531.8641 558.4838 595.0320 605.9824 624.3270 699.7700 708.5019 742.5944 785.9569 837.3593 941.7030 948.1834 982.9083 1016.5781 1048.3386 1049.4928 1085.2260 1105.5770 1112.5158 1144.2027 1162.6076 1201.2787 1225.4514 1251.0719 1274.1973 1287.2034 1299.1979 1309.3289 1322.3754 1374.4732 1403.1335 1446.1928 1447.8194 1462.3599 1485.9334 1608.7431 1638.3869 1673.1334 2910.8051 2971.0370 3022.5614 3026.5552 3029.4132 3035.1097 3041.4092 3101.8613 3111.2278 3478.7703 3483.2225 3495.9292 3613.3606 3618.1239
redmass: 4.2598 8.1510 3.8460 2.1756 4.3588 3.7002 4.3617 1.8369 1.4459 1.5735 2.8583 2.1704 2.7934 2.5790 3.8870 3.9125 2.6669 1.7480 1.3050 2.8401 1.7122 2.8617 3.6715 4.1115 2.4931 1.1002 2.0922 1.4769 1.8966 2.2487 2.1439 3.2829 2.9042 1.6331 1.7401 1.8589 1.3403 1.3813 1.4807 1.2884 1.4905 1.3619 1.2578 1.1218 1.1299 1.3816 1.3612 1.6589 1.0811 1.1092 1.0783 1.0865 1.2622 1.0943 4.0958 1.0698 1.0610 1.0839 1.0621 1.0683 1.0855 1.0913 1.1063 1.1094 1.0446 1.0449 1.0637 1.0989 1.0993
irintensity: 1.7295 2.0708 2.3034 0.8892 1.2770 0.5484 3.5693 23.5803 52.8691 39.0392 9.7319 9.3077 6.0817 8.7114 14.0214 3.3578 40.3474 199.0251 254.3689 14.3664 93.9121 41.6769 69.3862 22.3036 12.1911 8.0064 7.0856 2.1854 16.2355 3.9730 1.6494 32.7503 217.4362 3.4478 25.9971 22.8267 1.3322 7.9810 9.7031 6.1470 2.9626 18.9744 5.0002 2.7667 3.1327 11.5669 7.6900 5.2864 13.4968 11.7548 3.1996 4.5855 150.1766 36.2222 171.4735 73.5161 28.0357 15.4948 17.1406 11.0097 25.2334 37.0332 10.9257 16.4165 7.1181 0.1575 20.3308 1.8636 9.5332
temp: 298.150 k
press: 1.00000 atm
elementType: 16 8 8 7 7 6 6 6 6 6 6 1 1 1 1 1 1 1 1 1 1 1 1 1 1
symmnumber: 1
zpe: 540983.7 jmol-1
zpe.correction: 0.206050 hartree
zpe.thermalcorrener: 0.219632 hartree
zpe.thermalcorrenthalpy: 0.220576 hartree
zpe.thermalcorrgfe: 0.164702 hartree
zpe.sumelectzpe: -894.126822 hartree
zpe.sumelectthermal: -894.113240 hartree
zpe.sumelectthermalent: -894.112296 hartree
zpe.sumelectthermalfe: -894.168170 hartree
dipole: -0.6315 0.3964 -0.2631
dipole: 0.7907
quadrupole: -78.3346 -71.2358 -73.2003
quadrupole: -11.9523 -5.1446 -2.3378
quadrupole: -4.0777 3.0210 1.0566 -11.9523 -5.1446 -2.3378
hfenergy: -894.332872 hartree
pointgroup: C01 [X(C6H14N2O2S1)]
dipole: -0.2564709 -0.1671637 0.0552061 debye
dipolederiv: -0.4290237 -0.1006854 0.0068884 -0.104516 -0.1345757 -0.0761744 -0.0085868 -0.1017002 -0.1996297 -0.8992431 -0.3128847 0.1579472 -0.4262709 -0.5265786 0.0540553 0.2461699 0.0396979 -0.3879205 -1.0000466 0.0985745 0.0831782 0.2974958 -0.6224644 0.0669406 -0.087896 0.1368892 -0.3430949 -0.4609043 -0.0256582 0.1241014 -0.0575932 -0.4126849 -0.182849 0.2860745 -0.2021103 -0.8223405 -0.5509705 -0.302799 0.0054535 -0.3626532 -0.5381646 0.0448531 0.0506049 0.0615845 -0.6979663 -0.0094694 -0.0406912 0.0680556 0.0297585 0.0529477 -0.0588904 -0.0391968 0.1088079 -0.0610064 0.2885989 0.1568122 -0.2011083 0.1705679 -0.0619495 0.0205136 -0.1936679 0.0574989 0.4554263 0.4160491 -0.0061489 0.079901 -0.0059372 -0.0131241 -0.0156092 0.1499966 0.0278331 0.0755491 0.2133976 0.1699581 -0.0449866 0.312656 0.2216583 0.0881549 -0.1532099 0.0335306 0.0054916 1.5519512 0.0580684 -0.1680217 -0.0485678 1.0411608 -0.2308337 -0.0626351 -0.3583446 0.2576211 0.4391694 0.2280452 -0.0359145 0.166835 0.3840997 -0.0485535 0.1619713 0.1764224 0.3700638 -0.1660268 -0.0130948 -0.1150269 0.0552766 0.091359 0.011031 -0.0440551 -0.0198992 -0.0020864 0.0911722 0.0164694 0.0222154 -0.0108351 -0.1203665 0.064596 0.0677787 0.046763 0.0155347 -0.0412765 -0.0661693 -0.0590812 -0.047225 0.0603398 0.0057037 -0.0626469 0.0092763 0.0218488 -0.0591258 -0.0004286 -0.0296464 0.0162651 0.0140545 -0.1151812 -0.0351984 -0.1031827 -0.0910592 -0.0210446 -0.0179806 -0.0163068 -0.0156854 -0.0402631 0.1095742 -0.0383565 0.0673098 0.0495777 0.0220297 0.0119943 -0.0138615 0.0153251 -0.0676604 -0.0131162 -0.0074256 -0.0205791 0.0565962 -0.0092215 -0.0579559 0.0718971 -0.0837926 0.0053894 0.0389328 0.0579679 0.0137009 -0.084452 -0.0597855 0.0882581 -0.0010455 0.102191 -0.0655196 0.0014539 0.0226417 -0.0227391 0.0877116 -0.051914 -0.1113723 0.1380515 -0.0762948 -0.0324945 0.0582851 0.1077418 0.061706 -0.1474403 0.1065208 -0.0043401 -0.007878 -0.0316332 0.2833555 0.0721176 -0.1333738 0.0680625 0.2374572 0.1683469 0.0227611 0.0610124 0.0086315 0.0466972 0.1389848 -0.0220252 0.0329068 0.3563961 0.1190259 0.084024 0.0301737 0.0342836 0.0985842 -0.0858771 0.0392866 -0.1250448 0.2916275 0.1201837 -0.0007935 -0.1183618 -0.0068387 0.1406187 -0.0275464 -0.260628 -0.089561 0.224933 0.2216068 0.1260372 -0.0376363 0.0685571 0.1955812 0.0794343 -0.0413315 0.1011711 0.3311615 unknown
polarizability: 127.7444515|5.8699287|101.2463444|5.0137383|0.0516051|80.9330105 unknown
InChI: InChI=1S/C6H14N2O2S/c7-2-4-11-3-1-5(8)6(9)10/h5,9H,1-4,7-8H2
charge 0 multiplicity 1
25 atoms
S  -1.571844 1.790328 0.592471
O  0.528055 -1.691225 0.497988
O  2.827396 -1.477916 0.289582
N  2.432682 0.698037 -1.414885
N  -4.167703 -1.187413 -0.691089
C  1.264725 1.423672 0.737838
C  1.379359 0.388367 -0.439546
C  -0.015824 1.326265 1.588324
C  -2.489002 0.121158 0.544596
C  1.686816 -0.992945 0.124415
C  -3.450678 0.100754 -0.659105
H  2.157907 1.330034 1.390265
H  1.310649 2.427787 0.273344
H  0.396261 0.358682 -0.944013
H  0.030724 2.030552 2.435549
H  -0.175158 0.310519 1.98625
H  -1.725539 -0.670305 0.453462
H  -3.053401 -0.011401 1.481038
H  -4.198358 0.907652 -0.54335
H  -2.872641 0.325937 -1.585455
H  3.373904 0.422877 -1.120061
H  2.373805 1.631676 -1.825853
H  -3.602042 -1.986842 -0.987229
H  -5.089026 -1.167331 -1.132874
H  0.790234 -2.57052 0.887638
