program: Gaussian 09
title: 000268539
version: EM64L-G09RevD.01
frameworkgroup: C1[X(C10H13NO4S)]
method: RPBEPBE
basis: SDD
operation: Freq
keyword: #p
keyword: freq=noraman
keyword: PBEPBE/SDD
title: #p freq=noraman PBEPBE/SDD
converged: YES YES NO NO
title: Mulliken charges:
elementType: S O O O O N C C C C C C C C C C H H H H H H H H H H H H H
charge: 0.937408 -0.530192 -0.536532 -0.414563 -0.230375 -0.282114 -0.388231 -0.011930 -0.456518 -0.632482 -0.274296 -0.235490 0.225702 -0.206516 -0.205157 -0.217873 0.261090 0.253777 0.239985 0.239321 0.279263 0.234558 0.262896 0.297155 0.277974 0.242393 0.241665 0.238358 0.390720
chargesum: 0.00000
title: Mulliken charges with hydrogens summed into heavy atoms:
elementType: S O O O O N C C C C C C C C C C
charge: 0.937408 -0.530192 -0.536532 -0.023843 -0.230375 -0.282114 0.126637 -0.011930 0.022788 0.144235 0.022860 0.042484 0.225702 0.035877 0.036508 0.020485
polarizability: 1.79825508e+02 -1.27280467e+01 1.52861365e+02 9.33582082e+00 6.09863257e+00 1.16670025e+02
1716.lowfreq: -11.0736 -6.8402 -3.4400 -0.0010 0.0008 0.0012 7.8079 31.6773 56.4246
frequency: 7.4282 31.5974 56.3748 73.7905 81.8785 94.2674 126.0900 151.2665 174.4053 197.9532 226.4129 237.0379 242.7161 251.4884 291.7838 336.1365 368.4880 388.0966 403.9354 414.8336 463.8549 486.4572 521.9220 528.9663 583.5793 602.9561 659.3523 687.5431 690.5624 759.3893 771.0881 797.3409 802.2224 848.2817 921.7145 931.7727 934.0755 944.6964 978.0699 983.0521 1004.9340 1008.6860 1011.2969 1048.5439 1055.8731 1076.1489 1103.1796 1146.5311 1164.7370 1172.8570 1177.5413 1211.6815 1248.4030 1302.4295 1308.4147 1327.2489 1365.1713 1384.0868 1413.1038 1436.2430 1440.8169 1448.6592 1452.8880 1457.8996 1499.1631 1578.0693 1603.7806 1661.9608 2963.2667 2979.4806 3030.2317 3053.6678 3054.0960 3088.6544 3102.3633 3137.5235 3148.3694 3157.5338 3166.9106 3176.2393 3529.7625
redmass: 7.1676 4.0836 5.2270 9.3925 5.4459 3.8203 8.8486 4.7334 2.4024 2.4635 2.8362 2.3877 6.1450 6.6021 4.1229 3.6416 4.2750 6.9930 2.8345 2.2164 5.9131 3.3628 4.0383 2.8315 1.7255 6.4664 7.0591 3.0414 2.3177 1.4574 3.4528 7.6281 4.6404 1.2473 3.3071 2.4759 2.0125 2.5311 5.3993 1.4310 1.3353 4.0561 2.6270 2.1277 1.7316 1.5464 1.4822 1.9966 2.0036 1.0624 1.1192 1.4376 1.2314 1.3034 1.6125 1.2332 1.5429 8.4762 1.1243 2.2285 1.0844 1.1052 2.0304 1.0574 1.0541 5.8376 6.9495 8.3322 1.0334 1.0639 1.0604 1.0994 1.1013 1.0984 1.1028 1.0858 1.0887 1.0929 1.0969 1.1012 1.0639
irintensity: 0.4686 0.1838 0.3596 0.5993 2.7051 3.0963 5.8266 0.4429 2.7385 2.9254 2.6701 3.9317 16.9982 2.9214 3.1274 3.6071 8.4768 14.0523 0.0444 5.6538 77.1030 21.3300 54.6785 14.9830 270.6917 0.3361 15.4979 27.6714 34.8888 75.0393 13.0821 45.2287 47.7992 0.6284 49.7869 50.8028 43.2676 13.0600 2.2958 0.2608 0.2478 2.3949 56.0010 17.6274 71.8164 4.5049 27.8787 78.1500 19.0897 0.8012 5.4774 15.3668 25.3961 3.5758 8.5858 6.5258 24.2143 5.1103 27.3476 15.2331 9.1002 25.1916 16.0489 12.1820 12.8248 2.9388 0.4220 206.3993 38.4287 20.6431 13.2550 7.5493 10.9596 0.8753 9.8178 1.1235 10.5886 2.0158 7.7097 22.7674 36.8438
temp: 298.150 k
press: 1.00000 atm
elementType: 16 8 8 8 8 7 6 6 6 6 6 6 6 6 6 6 1 1 1 1 1 1 1 1 1 1 1 1 1
symmnumber: 1
zpe: 572720.1 jmol-1
zpe.correction: 0.218138 hartree
zpe.thermalcorrener: 0.235152 hartree
zpe.thermalcorrenthalpy: 0.236096 hartree
zpe.thermalcorrgfe: 0.171016 hartree
zpe.sumelectzpe: -1141.182484 hartree
zpe.sumelectthermal: -1141.165469 hartree
zpe.sumelectthermalent: -1141.164525 hartree
zpe.sumelectthermalfe: -1141.229605 hartree
dipole: 3.3640 -1.9531 5.4502
dipole: 6.6959
quadrupole: -92.7162 -97.7121 -105.3710
quadrupole: -1.8590 -3.6580 8.3058
quadrupole: 5.8835 0.8877 -6.7712 -1.8590 -3.6580 8.3058
hfenergy: -1141.4006214 hartree
pointgroup: C01 [X(C10H13N1O4S1)]
dipole: -1.3176967 -1.6148782 -1.6111378 debye
polarizability: 177.1754265|16.9243107|147.2024839|1.1985789|-17.7936072|124.9789878 unknown
InChI: InChI=1S/C10H13NO4S/c1-11(8-7-10(12)13)16(14,15)9-5-3-2-4-6-9/h2-6,12H,7-8H2,1H3
charge 0 multiplicity 1
29 atoms
S  -0.087035 0.948731 0.500264
O  -0.396761 2.534944 0.697428
O  0.788542 0.112323 1.602281
O  3.020115 -1.595019 0.709579
O  3.738036 0.581967 0.308071
N  0.547326 0.805694 -1.295365
C  1.122791 -0.524196 -1.606474
C  -1.719667 0.013448 0.314936
C  2.670209 -0.713349 -1.497114
C  1.301526 2.012612 -1.708251
C  -1.831533 -1.233361 0.950013
C  -2.759339 0.626476 -0.403358
C  3.207698 -0.474218 -0.10096
C  -3.066541 -1.915581 0.839649
C  -3.985087 -0.070848 -0.50064
C  -4.134714 -1.337506 0.115086
H  0.615677 -1.282001 -0.981757
H  0.842753 -0.735602 -2.6583
H  3.188698 -0.029869 -2.189103
H  2.887373 -1.753716 -1.796979
H  0.787047 2.897943 -1.297623
H  1.25383 2.064137 -2.812682
H  2.357545 2.025539 -1.377261
H  -0.989887 -1.635793 1.523466
H  -2.620383 1.611757 -0.85844
H  -3.191571 -2.890118 1.322886
H  -4.819409 0.375029 -1.051957
H  -5.088627 -1.870171 0.036173
H  3.182885 -1.341449 1.657931
