program: Gaussian 09
title: 000268552
version: EM64L-G09RevD.01
frameworkgroup: C1[X(C15H14N2O3)]
method: RPBEPBE
basis: SDD
operation: Freq
keyword: #p
keyword: freq=noraman
keyword: PBEPBE/SDD
title: #p freq=noraman PBEPBE/SDD
converged: YES YES NO NO
title: Mulliken charges:
elementType: O O O N N C C C C C C C C C C C C C C C H H H H H H H H H H H H H H
charge: -0.244621 -0.266169 -0.271480 -0.219715 -0.614104 -0.144296 0.448490 -0.472802 0.038664 0.302217 -0.010530 -0.412954 -0.383487 0.383292 -0.313906 -0.443662 0.211907 0.218017 -0.797373 -0.798075 0.295260 0.240272 0.247633 0.280443 0.316085 0.236148 0.224226 0.248203 0.245057 0.329981 0.372529 0.273859 0.240619 0.240273
chargesum: 0.00000
title: Mulliken charges with hydrogens summed into heavy atoms:
elementType: O O O N N C C C C C C C C C C C C C C C
charge: -0.244621 -0.266169 -0.271480 -0.219715 0.088407 -0.144296 0.448490 -0.177543 0.038664 0.302217 -0.010530 0.074951 -0.103044 0.383292 0.002179 -0.207514 0.211907 0.218017 -0.079888 -0.043324
polarizability: 2.59423157e+02 -1.80522996e+01 2.32056135e+02 -2.47447240e+00 -3.42597664e+00 9.21954958e+01
1716.lowfreq: -10.3557 -2.4036 -2.3020 -0.0010 -0.0008 -0.0008 32.2704 48.0255 70.5169
frequency: 32.2544 48.0009 70.5042 76.8124 85.6899 116.0964 122.5075 160.7430 184.6694 200.1849 206.4655 228.2884 253.6274 282.7959 310.2600 343.3832 355.4579 367.7063 403.3036 417.6055 429.6052 492.8484 500.3402 523.4140 529.9979 566.2504 566.3347 582.1728 595.6930 618.0723 630.6419 668.1814 690.6885 733.6762 763.2508 774.4087 787.6239 820.1221 849.2756 851.5561 890.0009 926.4486 956.8926 978.3941 982.6948 989.7779 1013.2800 1030.9124 1035.0861 1042.2594 1048.5051 1103.3622 1108.6644 1145.0217 1160.9987 1190.4734 1217.7639 1237.9048 1243.0972 1248.5843 1263.4373 1301.9878 1329.0232 1339.8992 1372.8293 1388.3112 1398.6525 1410.3552 1422.4966 1446.0216 1456.8044 1464.8186 1468.3523 1480.9396 1495.8037 1557.3162 1580.1116 1597.4925 1616.2967 1624.3405 1642.8623 1714.0618 2924.7659 2963.5402 2985.9995 2986.6712 3023.7756 3063.9045 3071.9152 3092.9516 3132.4989 3134.0352 3172.9566 3211.4122 3377.3542 3620.4510
redmass: 5.3218 7.0416 3.0271 3.8569 1.3887 3.1027 4.5190 5.7170 2.9858 1.1405 3.7888 3.0450 5.2662 4.7740 6.5419 4.1734 5.4150 5.0539 4.5277 4.5435 4.9573 4.6232 5.8432 3.0296 3.9241 5.7795 3.5868 3.1238 3.7406 2.3303 4.3436 2.5475 5.1670 4.8639 1.0914 2.8063 5.4708 2.5419 1.5931 2.4549 3.9341 3.2667 2.3154 2.7861 1.4345 1.9897 2.3215 1.6963 2.0827 1.5653 2.9658 2.1194 2.5472 1.4850 1.4018 1.6463 3.1068 2.5862 1.6313 2.1269 1.6858 3.3118 3.3365 2.7647 1.5966 1.3811 1.5521 2.7121 4.2351 1.1062 1.0471 1.1880 1.0955 1.0859 2.7208 2.9335 5.5513 7.6926 3.5253 3.0270 7.4358 8.4683 1.0706 1.0799 1.0368 1.0390 1.0888 1.0961 1.0976 1.1007 1.0980 1.0909 1.0933 1.0933 1.0569 1.0946
irintensity: 3.9133 1.7553 0.9729 11.3681 2.5367 0.5381 4.7422 2.3362 2.5794 0.0921 3.7566 1.8941 4.6593 21.1199 1.2231 9.7831 1.1704 0.3656 3.2303 1.3382 3.4902 17.3386 5.9105 22.8670 5.1844 1.0882 5.1404 2.4728 4.5227 64.4524 32.4673 89.1826 5.4800 6.7864 127.5190 1.2592 1.1023 11.6179 24.2385 28.9426 14.0341 1.3253 36.6190 16.5648 3.4263 4.3821 12.1513 5.2750 5.3060 8.7054 1.9833 7.0702 7.0837 6.8103 31.4008 4.2988 67.6752 15.9069 7.0501 63.2879 20.8128 386.6993 116.3155 31.3232 27.3856 99.0430 19.7781 20.8138 46.3956 47.4222 13.6225 7.2030 10.5533 13.4550 134.7472 579.0569 21.3892 135.0505 13.7419 19.1982 329.9377 1.6687 49.0811 1.8566 20.6517 5.9338 19.3339 10.9018 13.5350 23.3280 7.3471 18.9233 0.5733 6.3181 102.7345 84.0660
temp: 298.150 k
press: 1.00000 atm
elementType: 8 8 8 7 7 6 6 6 6 6 6 6 6 6 6 6 6 6 6 6 1 1 1 1 1 1 1 1 1 1 1 1 1 1
symmnumber: 1
zpe: 687404.6 jmol-1
zpe.correction: 0.261819 hartree
zpe.thermalcorrener: 0.279591 hartree
zpe.thermalcorrenthalpy: 0.280535 hartree
zpe.thermalcorrgfe: 0.215875 hartree
zpe.sumelectzpe: -913.788946 hartree
zpe.sumelectthermal: -913.771174 hartree
zpe.sumelectthermalent: -913.770230 hartree
zpe.sumelectthermalfe: -913.834890 hartree
dipole: 0.0144 -1.0607 0.3838
dipole: 1.1281
quadrupole: -115.9694 -114.2643 -115.6522
quadrupole: -13.7378 0.0877 -3.5984
quadrupole: -0.6740 1.0310 -0.3569 -13.7378 0.0877 -3.5984
hfenergy: -914.050765 hartree
pointgroup: C01 [X(C15H14N2O3)]
dipole: -0.0202495 -0.4093115 -0.1703667 debye
polarizability: 259.5171046|18.1391789|230.8071752|-9.1593293|9.3989915|93.3505082 unknown
InChI: InChI=1S/C15H14N2O3/c1-7-3-4-10-12-9(5-6-17(10)8(2)18)13(15(16)20)14(19)11(7)12/h3-5,13H,6,16H2,1-2H3
charge 0 multiplicity 1
34 atoms
O  3.408238 0.918303 -0.480469
O  2.419503 -3.308953 0.1253
O  -4.274674 0.694826 0.164985
N  -2.358408 -0.656998 0.004081
N  4.137805 -1.734352 0.043762
C  -0.066066 0.13168 -0.202897
C  0.44324 -1.201499 -0.496629
C  1.92385 -1.079209 -0.805792
C  0.963476 1.103809 -0.189978
C  -1.42201 0.433835 0.051195
C  2.239834 0.419756 -0.480243
C  -1.848568 -2.078171 -0.030599
C  -0.395673 -2.262799 -0.424745
C  0.68501 2.472689 0.088163
C  -1.716282 1.7991 0.318834
C  -0.676708 2.77131 0.333793
C  2.841879 -2.146407 -0.145646
C  -3.755516 -0.458215 0.075002
C  1.761877 3.534359 0.118333
C  -4.642067 -1.70092 0.034257
H  2.09204 -1.199045 -1.898561
H  -2.475656 -2.6495 -0.738807
H  -2.006384 -2.541094 0.969204
H  -0.04997 -3.288539 -0.579967
H  -2.746202 2.102892 0.502727
H  -0.956216 3.809529 0.548666
H  1.335376 4.526142 0.344275
H  2.532653 3.29908 0.874673
H  2.296838 3.591699 -0.847228
H  4.808128 -2.393059 0.439347
H  4.396545 -0.758102 -0.157236
H  -5.67433 -1.363696 0.205934
H  -4.372998 -2.444327 0.80591
H  -4.597567 -2.204224 -0.949842
