program: Gaussian 09
title: 000022850
version: EM64L-G09RevD.01
frameworkgroup: C1[X(C12H13N5)]
method: RPBEPBE
basis: SDD
operation: Freq
keyword: #pfreq=noraman
keyword: PBEPBE/SDD
title: #p freq=noraman PBEPBE/SDD
converged: YES YES NO NO
title: Mulliken charges:
elementType: N N N N N C C C C C C C C C C C C H H H H H H H H H H H H H
charge: -0.145608 -0.673627 -0.139451 -0.699544 -0.689285 -0.008869 0.369328 0.584961 -0.601496 -0.243550 -0.456330 0.156654 0.493449 -0.336815 -0.277780 -0.396234 -0.386756 0.207706 0.266192 0.213295 0.242544 0.245269 0.214996 0.210996 0.331234 0.294706 0.303857 0.308866 0.305867 0.305426
chargesum: 0.00000
title: Mulliken charges with hydrogens summed into heavy atoms:
elementType: N N N N N C C C C C C C C C C C C
charge: -0.145608 -0.047687 -0.139451 -0.086821 -0.077992 -0.008869 0.369328 0.584961 -0.393790 0.022642 -0.243035 0.156654 0.493449 -0.094271 -0.032512 -0.181238 -0.175760
polarizability: 5.06187477e+02 -5.58205630e+00 1.71942228e+02 -5.58583130e-03 5.00434607e-05 6.65637341e+01
1716.lowfreq: -6.4153 -3.2760 -0.0007 0.0003 0.0008 10.1292 23.1720 43.4074 60.0445
frequency: 23.1587 43.4063 60.0443 95.8401 176.7976 183.3218 210.1673 228.9232 234.8650 317.2082 325.3698 362.4263 363.0006 377.2705 380.3403 385.3399 394.5207 402.6182 421.6372 437.7934 459.3936 469.3609 515.6065 531.7906 575.7283 592.7883 632.9357 635.7768 641.0479 732.6711 736.8927 747.2843 773.9454 799.8778 812.1481 823.8123 834.4637 835.8082 896.0878 945.8647 954.3049 963.6898 965.5047 987.8936 1011.9114 1015.3534 1075.1989 1113.6895 1123.0992 1148.8580 1189.3286 1234.9116 1258.3582 1274.7908 1298.5759 1315.0535 1334.6924 1354.8082 1384.3834 1415.2884 1449.6566 1493.1040 1497.3544 1503.6823 1563.2358 1568.6643 1590.1358 1624.5534 1635.2641 1642.0918 1644.5823 3112.4182 3114.4171 3120.9138 3125.0612 3155.6302 3161.0270 3161.7731 3512.4219 3563.4383 3564.2571 3690.4368 3704.7025 3705.1278
redmass: 3.9538 5.0123 5.0396 4.8408 5.6204 5.2614 4.1681 4.7865 7.7781 2.9994 1.8297 2.9847 1.3692 1.9943 1.1894 1.0241 1.0563 3.1367 3.3783 3.4212 6.7374 2.7068 5.6726 2.3760 5.8973 5.4243 1.4847 6.8059 1.9833 2.9839 6.2475 2.4058 4.9874 1.6103 1.2643 5.6686 1.7809 2.3160 7.4065 2.5719 1.3765 1.3424 1.3380 2.6219 1.5220 1.4300 1.3769 1.5738 1.2726 1.3123 1.7745 2.0201 3.2425 1.6777 1.4220 3.2865 5.1429 3.4877 5.0654 6.9456 4.1748 3.2866 3.8402 3.3829 3.2861 6.2054 1.6435 4.0214 4.3280 1.2330 1.3513 1.0890 1.0909 1.0884 1.0887 1.0950 1.0946 1.0936 1.0465 1.0447 1.0449 1.1014 1.1040 1.1040
irintensity: 0.4108 6.0973 2.6587 0.0027 0.7001 0.2851 8.6660 5.0650 0.2128 2.9797 54.6945 8.1342 128.0667 124.1276 425.1052 16.8127 61.7024 0.0173 0.5694 2.0880 68.3255 0.1082 2.6527 25.3756 15.6215 0.2709 24.4422 3.3967 64.4635 0.4131 0.1313 2.6097 4.4804 19.2400 0.3852 3.2437 126.6334 57.0291 0.4919 4.8982 0.4540 0.0236 0.6843 0.0969 0.1183 0.7487 1.5351 13.4907 34.7139 141.1777 15.9505 20.3063 46.2993 139.1059 19.0217 266.4935 169.9391 126.4702 9.4645 7.0724 1.3052 67.3656 18.5171 103.9762 42.4410 36.5494 350.0166 278.0041 471.0122 719.5992 31.1569 32.9950 40.9260 41.5941 26.3130 19.2367 15.7651 6.6090 23.6702 361.3310 5.9813 48.8188 20.5568 20.7193
temp: 298.150 k
press: 1.00000 atm
elementType: 7 7 7 7 7 6 6 6 6 6 6 6 6 6 6 6 6 1 1 1 1 1 1 1 1 1 1 1 1 1
symmnumber: 1
zpe: 620508.8 jmol-1
zpe.correction: 0.236339 hartree
zpe.thermalcorrener: 0.251887 hartree
zpe.thermalcorrenthalpy: 0.252831 hartree
zpe.thermalcorrgfe: 0.193367 hartree
zpe.sumelectzpe: -737.618020 hartree
zpe.sumelectthermal: -737.602473 hartree
zpe.sumelectthermalent: -737.601528 hartree
zpe.sumelectthermalfe: -737.660992 hartree
dipole: 0.2105 1.9008 0.0098
dipole: 1.9124
quadrupole: -33.6848 -81.2960 -109.5169
quadrupole: -0.8825 0.0249 -0.0078
quadrupole: 41.1478 -6.4634 -34.6843 -0.8825 0.0249 -0.0078
hfenergy: -737.8543598 hartree
pointgroup: C01 [X(C12H13N5)]
dipole: -0.0804478 -0.2989699 0.6857519 debye
polarizability: 506.2191618|-2.1841728|83.7981539|3.9791311|-38.9683181|154.6761237 unknown
InChI: InChI=1S/C12H13N5/c13-8-1-4-10(5-2-8)16-17-12-6-3-9(14)7-11(12)15/h1-7H,13-15H2
charge 0 multiplicity 1
30 atoms
N  -0.287993 -0.173641 0.269215
N  -1.998346 -1.019695 2.186394
N  0.535094 0.241556 -0.676116
N  -5.867574 0.197182 -0.550887
N  6.134182 -0.133067 0.170467
C  -1.661112 -0.047636 -0.013714
C  -2.553283 -0.506922 1.02811
C  -4.488986 0.111213 -0.362626
C  -3.956239 -0.420768 0.838411
C  -2.221093 0.482756 -1.210738
C  -3.602905 0.567103 -1.396209
C  1.918064 0.108309 -0.37562
C  4.753561 -0.052153 -0.012319
C  2.813879 0.555413 -1.387486
C  2.470228 -0.424054 0.828507
C  4.20515 0.480045 -1.216657
C  3.857754 -0.503111 1.007226
H  -4.632757 -0.768944 1.629418
H  -1.523754 0.823374 -1.982782
H  -4.019794 0.978506 -2.323243
H  2.381517 0.962359 -2.308012
H  1.786382 -0.769552 1.610039
H  4.876305 0.830776 -2.010327
H  4.269034 -0.915173 1.93801
H  -0.979172 -1.040458 2.232654
H  -2.569121 -1.35783 2.954126
H  -6.515823 -0.118337 0.164668
H  -6.248004 0.579657 -1.411457
H  6.774549 0.186027 -0.550553
H  6.524955 -0.513135 1.027502
