program: Gaussian 09
title: 000268520
version: EM64L-G09RevD.01
frameworkgroup: C1[X(C15H12N2OS)]
method: RPBEPBE
basis: SDD
operation: Freq
keyword: #p
keyword: freq=noraman
keyword: PBEPBE/SDD
title: #p freq=noraman PBEPBE/SDD
converged: YES YES NO NO
title: Mulliken charges:
elementType: S O N N C C C C C C C C C C C C C C C H H H H H H H H H H H H
charge: 0.221968 -0.183245 0.026578 -0.542759 -0.651599 0.497917 0.514283 0.065306 -0.361169 -0.324401 -0.370749 -0.406691 -0.140159 -0.234342 -0.242284 -0.238419 -0.225367 -0.244606 -0.245715 0.256898 0.271403 0.252974 0.247287 0.228224 0.228792 0.228115 0.224357 0.230445 0.228935 0.338494 0.349530
chargesum: 0.00000
title: Mulliken charges with hydrogens summed into heavy atoms:
elementType: S O N N C C C C C C C C C C C C C C C
charge: 0.221968 -0.183245 0.026578 0.145265 -0.651599 0.497917 0.514283 0.065306 -0.104271 -0.052997 -0.117776 -0.159404 -0.140159 -0.006118 -0.013493 -0.010304 -0.001010 -0.014161 -0.016781
polarizability: 2.05130571e+02 1.56435420e+00 2.16221961e+02 -1.42148864e+01 -8.12659102e+00 1.53393870e+02
1716.lowfreq: -9.8384 -1.0217 -0.0014 -0.0012 -0.0008 6.3420 22.8116 32.2086 42.2887
frequency: 22.5759 32.0983 42.1963 71.0928 92.9684 125.2063 172.0047 197.8577 237.3502 246.4600 255.9706 289.7963 307.8393 332.5574 398.7008 403.7862 414.0673 463.4813 483.0640 498.8841 532.6350 550.8757 569.0848 595.6262 614.7553 616.2123 627.9155 632.1407 670.1787 696.2085 696.8557 706.2116 745.9319 766.6042 828.0462 845.6642 852.6521 886.1668 891.8888 926.2873 937.2190 975.6806 977.9351 989.5145 990.5007 995.3871 995.7709 1024.1098 1030.4052 1031.2272 1088.6994 1091.0377 1163.9480 1173.3968 1173.8644 1190.6583 1195.9891 1198.2869 1210.7117 1300.6116 1317.3995 1324.9357 1374.8302 1380.3838 1431.0420 1436.8203 1477.4186 1481.7326 1555.2091 1586.9064 1590.9000 1606.0589 1608.7828 1611.5382 1661.3345 3124.9709 3125.8978 3133.2295 3136.4368 3144.8414 3150.1133 3154.6009 3159.8519 3167.1810 3170.5865 3528.5480 3679.6990
redmass: 4.0051 5.6100 4.1521 4.8079 5.5363 9.4505 7.8084 6.9224 4.7656 5.1721 6.6334 5.5346 4.9277 4.8475 2.7855 2.8757 10.5026 1.2054 4.0384 3.6943 1.4244 8.3942 7.4161 7.6574 6.1719 6.4169 3.3183 4.6643 6.3382 2.1967 2.7215 2.1450 2.2041 2.0273 3.8458 1.2590 1.2537 5.9029 3.2481 1.5433 1.8144 1.4007 1.3980 5.7887 5.3077 1.3274 1.3609 2.8198 2.3446 2.1667 1.6119 1.6068 3.2662 1.0812 1.0593 3.6587 1.1209 1.1391 4.0700 3.7996 1.3677 1.3240 6.7128 8.4542 2.2447 2.2587 2.1650 2.1807 3.9434 5.9077 6.1353 3.8226 3.7743 2.3281 5.8306 1.0848 1.0847 1.0880 1.0885 1.0927 1.0928 1.0961 1.0961 1.1012 1.0997 1.0452 1.1049
irintensity: 0.6007 3.3226 0.1555 0.3450 4.0949 3.7964 0.9011 4.4454 2.7149 1.6860 1.8053 1.6330 0.5198 0.0371 0.0098 0.4917 10.6531 19.0459 5.6874 0.6859 207.7938 47.2497 6.0453 2.9252 0.7833 0.2470 50.0411 15.6889 19.3739 39.6103 13.3777 36.6734 66.3211 48.8005 19.2165 0.3953 0.8001 2.0477 14.9677 1.2525 1.7840 0.4697 0.5703 1.5715 1.7731 0.5958 0.4370 62.2484 29.9293 13.2625 11.9543 8.4096 2.5635 0.4037 0.2824 130.9804 4.8739 0.8674 13.0967 179.2222 4.9213 0.1506 0.6640 0.2195 18.4836 6.6679 20.1450 19.5554 411.9660 1.4423 0.4042 55.0368 82.9105 262.4169 89.4575 1.2595 0.2690 3.0366 9.2553 22.6021 20.3554 24.9821 28.4935 18.6152 11.1649 134.5202 47.4083
temp: 298.150 k
press: 1.00000 atm
elementType: 16 8 7 7 6 6 6 6 6 6 6 6 6 6 6 6 6 6 6 1 1 1 1 1 1 1 1 1 1 1 1
symmnumber: 1
zpe: 611268.4 jmol-1
zpe.correction: 0.232820 hartree
zpe.thermalcorrener: 0.248973 hartree
zpe.thermalcorrenthalpy: 0.249917 hartree
zpe.thermalcorrgfe: 0.187630 hartree
zpe.sumelectzpe: -1160.275016 hartree
zpe.sumelectthermal: -1160.258862 hartree
zpe.sumelectthermalent: -1160.257918 hartree
zpe.sumelectthermalfe: -1160.320206 hartree
dipole: -0.2521 2.2967 -4.3025
dipole: 4.8836
quadrupole: -106.5899 -87.5541 -126.6743
quadrupole: 0.6747 -4.6797 -8.3972
quadrupole: 0.3495 19.3853 -19.7348 0.6747 -4.6797 -8.3972
hfenergy: -1160.5078354 hartree
pointgroup: C01 [X(C15H12N2O1S1)]
dipole: 0.2038871 -0.8539913 -1.7090382 debye
polarizability: 204.2500616|0.2001379|215.9142857|14.908655|10.5824417|154.5820547 unknown
InChI: InChI=1S/C15H12N2OS/c16-14-17-13(18)15(19-14,11-7-3-1-4-8-11)12-9-5-2-6-10-12/h1-10H,16H2
charge 0 multiplicity 1
31 atoms
S  0.241518 -1.701641 -1.516198
O  -0.050997 -0.742298 2.366197
N  -0.008056 -2.685545 1.032176
N  0.16717 -4.324786 -0.64926
C  0.050561 -0.403452 -0.08138
C  1.293916 0.493246 -0.116621
C  -1.27715 0.370827 -0.171864
C  -0.005253 -1.297643 1.244601
C  1.340061 1.587553 -1.019923
C  -1.439108 1.492281 0.687464
C  2.430833 0.21968 0.68457
C  -2.360317 -0.018964 -0.995794
C  0.114515 -3.02721 -0.241042
C  2.498792 2.384812 -1.126047
C  -2.65483 2.206279 0.711386
C  3.588721 1.021758 0.58223
C  -3.576397 0.702035 -0.97377
C  3.630157 2.104497 -0.324722
C  -3.729805 1.817576 -0.121536
H  0.463837 1.814905 -1.637414
H  -0.617935 1.787402 1.347448
H  2.413229 -0.605057 1.40408
H  -2.252184 -0.880544 -1.662129
H  2.518924 3.223593 -1.830782
H  -2.763215 3.064527 1.383764
H  4.456453 0.802573 1.21426
H  -4.401367 0.389139 -1.623762
H  4.529952 2.724828 -0.403462
H  -4.67275 2.375451 -0.10453
H  0.256311 -4.576972 -1.63106
H  0.118414 -5.054647 0.061421
