program: Gaussian 09
title: 000268567
version: EM64L-G09RevD.01
frameworkgroup: C1[X(C18H20N6O2)]
method: RPBEPBE
basis: SDD
operation: Freq
keyword: #p
keyword: freq=noraman
keyword: PBEPBE/SDD
title: #p freq=noraman PBEPBE/SDD
converged: YES YES NO NO
title: Mulliken charges:
elementType: O O N N N N N N C C C C C C C C C C C C C C C C C C H H H H H H H H H H H H H H H H H H H H
charge: -0.328772 -0.193026 -0.165647 -0.054773 0.064459 0.064575 -0.656485 -0.447799 -0.549065 0.164606 0.449929 -0.055748 -0.665967 -0.167446 0.374281 -0.404563 -0.383961 -0.349699 -0.513810 0.202966 -0.222456 -0.240392 -0.267525 0.258736 -0.213593 -0.674801 0.255505 0.253306 0.236773 0.227186 0.243559 0.278172 0.236432 0.227856 0.227565 0.219291 0.221147 0.226591 0.312314 0.347232 0.335445 0.230116 0.229276 0.213239 0.227340 0.227631
chargesum: 0.00000
title: Mulliken charges with hydrogens summed into heavy atoms:
elementType: O O N N N N N N C C C C C C C C C C C C C C C C C C
charge: -0.328772 -0.193026 -0.165647 -0.054773 0.064459 0.064575 0.003060 -0.112354 -0.040254 0.164606 0.449929 -0.055748 0.041551 -0.167446 0.374281 -0.126391 -0.147529 -0.121843 -0.286245 0.202966 -0.003165 -0.019245 -0.040934 0.258736 0.245799 -0.006591
polarizability: 4.42769648e+02 -3.02663423e+01 2.51229629e+02 5.97282639e+00 3.03606388e+00 1.60559074e+02
1716.lowfreq: -11.4763 -3.6371 -1.5631 -0.0007 -0.0004 -0.0001 3.1531 13.6150 19.5827
frequency: -0.8254 13.5271 19.5397 19.6252 42.1676 53.0349 55.3637 75.6998 97.4810 129.0783 136.6333 143.2249 161.1981 161.9882 174.5253 203.7891 218.1095 249.3330 253.2689 259.2950 290.4785 311.2129 327.2247 358.2139 374.8287 393.9649 412.2687 418.5084 460.5092 471.5849 483.6584 512.4467 516.8243 544.0945 548.7619 557.7285 593.4379 614.1193 623.7396 637.4977 657.7046 664.8924 687.6456 692.5604 707.4326 710.6111 717.2303 747.2284 754.5250 800.6421 807.2161 810.5905 813.4141 832.6429 868.8469 869.2498 907.1683 925.5346 943.2533 954.9184 956.1041 975.1133 976.6734 993.9922 1009.6425 1031.1390 1041.5604 1053.5318 1091.0431 1091.4458 1107.6488 1111.5156 1112.9274 1133.7896 1140.3022 1172.5055 1198.4105 1201.5060 1208.5709 1242.9507 1250.4785 1250.5009 1267.0624 1279.2402 1321.2535 1333.6539 1341.3783 1356.6950 1371.8931 1381.7945 1383.7486 1394.1930 1400.0181 1441.0525 1449.2194 1452.3908 1455.3396 1464.0887 1468.0513 1476.7647 1477.2318 1489.4843 1492.4605 1503.2942 1506.8959 1521.8220 1548.8254 1578.1398 1592.4665 1620.3266 1630.0735 1704.9183 2936.1103 2983.8502 2994.6246 3006.8052 3025.9924 3035.1081 3064.2539 3090.9681 3091.8193 3104.9333 3122.6406 3128.5970 3129.0804 3144.3287 3147.7316 3158.2722 3169.6442 3512.7471 3551.1135 3684.0327
redmass: 4.9891 4.5639 5.0631 4.1689 4.1148 3.1058 4.5644 3.6181 3.2447 3.6394 4.2204 4.8471 2.9821 1.5855 4.0996 5.2916 4.2974 4.3339 1.2350 3.7496 3.6649 6.8309 4.5319 4.4615 3.8077 2.5496 2.0178 2.8179 1.9653 4.1057 3.9579 2.9041 5.5687 5.5363 5.7321 4.6947 5.0302 5.9709 1.4006 1.1906 8.1289 6.1122 3.6805 1.8069 4.3836 4.8330 5.9377 4.8974 1.8752 1.0963 3.6558 1.9426 2.1587 2.4882 1.7452 3.0846 1.5546 5.0667 2.4296 4.6684 1.4165 2.3144 1.8790 3.3757 2.5392 2.0702 2.6668 2.6663 3.6399 1.6922 1.4480 1.5535 2.1553 2.7225 1.4684 1.0539 1.4014 1.3718 1.7477 3.1376 1.5404 1.8414 2.2922 4.5023 2.1951 1.4050 1.7859 1.3685 2.4257 6.5732 4.1550 3.4386 1.3258 1.3516 2.2145 3.4348 2.7735 1.0408 1.2076 1.0603 1.1118 1.1124 1.2459 2.7197 2.0614 4.7276 3.3797 6.0411 1.4953 6.0206 3.8849 9.0568 1.0448 1.0598 1.0357 1.0581 1.0910 1.1015 1.1068 1.0978 1.0986 1.1025 1.0844 1.0881 1.0923 1.0923 1.0925 1.0940 1.0999 1.0473 1.0760 1.1016
irintensity: 1.4755 0.4900 0.2235 0.9727 0.2374 3.5660 0.8697 0.3358 2.0635 3.3585 0.9373 0.3462 3.7124 2.4509 10.3773 0.0523 3.5981 7.5417 1.5873 9.0710 8.9249 1.7402 4.3005 10.0731 6.5949 2.0068 51.4856 1.6817 84.6079 6.3909 4.1872 13.6827 5.3466 0.8399 3.9019 5.3127 0.8523 0.5878 12.0811 152.3579 1.8557 2.2912 5.0226 42.9552 16.8882 36.2356 24.8153 4.7824 87.6520 3.2769 10.6016 3.8678 1.6049 63.6161 8.6039 2.2873 3.0442 45.3514 48.2774 93.8285 5.9369 6.7427 1.6533 40.0996 7.1444 26.4645 178.5502 328.0766 173.6960 1.7210 17.6275 26.1130 22.6945 402.8379 4.9740 0.2072 3.9441 27.0077 52.8008 14.3708 6.9173 10.8919 22.1998 9.1143 145.2878 2.9363 38.6571 39.8136 138.9111 38.7214 75.0334 48.3126 39.3638 15.3092 24.0357 257.0596 76.7834 11.8548 38.5403 29.0925 3.7470 62.0375 3.4286 546.2441 147.9980 341.7064 223.4921 11.3462 144.7055 178.7914 541.9811 171.5800 94.8240 29.8666 27.4466 24.3827 29.3059 8.3793 8.6617 19.7815 32.9375 47.7396 14.4877 6.0678 22.0432 33.2205 20.6762 34.2960 12.1549 83.8518 52.7076 57.6095
temp: 298.150 k
press: 1.00000 atm
elementType: 8 8 7 7 7 7 7 7 6 6 6 6 6 6 6 6 6 6 6 6 6 6 6 6 6 6 1 1 1 1 1 1 1 1 1 1 1 1 1 1 1 1 1 1 1 1
symmnumber: 1
zpe: 950607.0 jmol-1
zpe.correction: 0.362067 hartree
zpe.thermalcorrener: 0.385625 hartree
zpe.thermalcorrenthalpy: 0.386570 hartree
zpe.thermalcorrgfe: 0.305766 hartree
zpe.sumelectzpe: -1175.008406 hartree
zpe.sumelectthermal: -1174.984847 hartree
zpe.sumelectthermalent: -1174.983903 hartree
zpe.sumelectthermalfe: -1175.064707 hartree
dipole: -1.6998 7.4225 -0.3223
dipole: 7.6215
quadrupole: -120.7264 -138.9851 -146.9780
quadrupole: -7.4666 8.9878 0.8959
quadrupole: 14.8367 -3.4219 -11.4148 -7.4666 8.9878 0.8959
hfenergy: -1175.3704727 hartree
pointgroup: C01 [X(C18H20N6O2)]
dipole: 0.3847245 2.9550505 -0.3327973 debye
polarizability: 435.1936757|47.2429086|255.5219236|-9.7613135|-18.4201532|163.8427519 unknown
InChI: InChI=1S/C18H20N6O2/c1-3-26-18(25)23-15-9-14(19)16-17(22-15)20-10-12(21-16)11-24(2)13-7-5-4-6-8-13/h4-10,23H,3,11,19H2,1-2H3
charge 0 multiplicity 1
46 atoms
O  6.562195 -0.154477 -0.34618
O  4.754465 -1.668557 -0.37229
N  -4.14722 0.145111 -0.695158
N  -0.936645 1.852371 -0.082792
N  0.01826 -0.848985 -0.200931
N  2.257654 -0.088203 -0.234797
N  0.838933 3.940621 -0.077078
N  4.49502 0.714973 -0.26995
C  -3.287075 1.117497 -0.013622
C  -1.794927 0.805563 -0.089843
C  -4.868851 -0.836781 0.010971
C  0.408116 1.563592 -0.131096
C  -4.360666 0.3329 -2.136222
C  0.916252 0.213263 -0.188605
C  1.352952 2.667589 -0.12812
C  -1.294492 -0.540872 -0.154478
C  -5.934619 -1.551654 -0.618956
C  -4.555335 -1.166611 1.367888
C  2.718249 2.342743 -0.175813
C  3.106309 0.959512 -0.226647
C  -6.652937 -2.540738 0.083408
C  -5.289788 -2.151784 2.05783
C  -6.345708 -2.850311 1.427942
C  5.184362 -0.503254 -0.332818
C  7.496836 -1.311542 -0.413303
C  8.910227 -0.73738 -0.400779
H  -3.594359 1.202769 1.045708
H  -3.43497 2.124275 -0.449482
H  -3.566711 0.983415 -2.538581
H  -5.342007 0.801491 -2.364271
H  -4.30568 -0.631447 -2.674729
H  -1.996087 -1.381335 -0.174613
H  -6.214369 -1.327297 -1.652312
H  -3.720883 -0.678692 1.882394
H  3.480036 3.13055 -0.174199
H  -7.46629 -3.069604 -0.42744
H  -5.020749 -2.38449 3.094768
H  -6.907881 -3.619024 1.967751
H  1.430939 4.765488 -0.06647
H  -0.178166 4.026763 -0.041456
H  5.110264 1.530907 -0.253322
H  7.301743 -1.971148 0.451791
H  7.282245 -1.883073 -1.334744
H  9.647226 -1.559627 -0.448413
H  9.074703 -0.073676 -1.267031
H  9.093526 -0.16033 0.521887
