program: Gaussian 09
title: 000268460
version: EM64L-G09RevD.01
frameworkgroup: C1[X(C7H4Cl2N2)]
method: RPBEPBE
basis: SDD
operation: Freq
keyword: #p
keyword: freq=noraman
keyword: PBEPBE/SDD
title: #p freq=noraman PBEPBE/SDD
converged: NO NO NO NO
title: Mulliken charges:
elementType: Cl Cl N N C C C C C C C H H H H
charge: 0.023859 -0.058145 -0.312273 -0.054686 0.415407 0.023671 -0.271611 -0.346999 -0.278756 -0.092660 -0.188589 0.274266 0.257659 0.351817 0.257040
chargesum: 0.00000
title: Mulliken charges with hydrogens summed into heavy atoms:
elementType: Cl Cl N N C C C C C C C
charge: 0.023859 -0.058145 0.039543 -0.054686 0.415407 0.023671 -0.271611 -0.072733 -0.021097 -0.092660 0.068451
polarizability: 1.58806796e+02 -9.07552345e-01 1.18970936e+02 -1.13713093e-03 8.73570099e-04 4.02642875e+01
1716.lowfreq: -3.9503 -0.0029 -0.0021 -0.0011 8.8296 9.1254 111.5891 129.1880 130.3806
frequency: 111.5869 129.1874 130.3798 263.3500 276.3734 333.7139 346.4379 401.5849 424.5827 490.5640 585.4049 591.8325 603.2940 686.5897 688.9487 746.4921 772.1045 814.0021 870.1109 887.0464 959.3610 986.6482 1048.7526 1091.4790 1135.8386 1218.3585 1245.4120 1296.2125 1318.5370 1386.5154 1432.1944 1470.7293 1496.0045 1551.7986 1633.2751 3158.6964 3170.2240 3179.8076 3597.5503
redmass: 8.0059 23.9654 6.0470 8.1016 5.6892 8.1584 16.6185 12.7086 2.8845 5.2614 4.6672 7.8636 9.1036 1.1184 8.9426 3.6663 5.5098 1.6058 1.4482 7.1001 1.3153 4.2949 2.8918 4.8651 1.4579 2.2569 1.6698 4.2177 2.8481 3.3254 1.9682 5.3140 4.8047 8.4552 8.3059 1.0879 1.0938 1.0983 1.0824
irintensity: 0.0162 0.0323 0.6704 0.8890 3.3065 0.1411 2.3248 6.4727 16.7317 13.7401 6.9680 5.9462 1.7270 100.1080 37.3284 0.4532 14.0105 48.4111 22.7541 18.6272 0.1544 30.3035 47.2075 16.6971 0.1610 18.6017 2.1545 44.3743 3.3681 13.4040 38.2874 16.9078 66.5038 8.0181 13.8524 0.0307 0.7017 5.7182 139.2251
temp: 298.150 k
press: 1.00000 atm
elementType: 17 17 7 7 6 6 6 6 6 6 6 1 1 1 1
symmnumber: 1
zpe: 254391.8 jmol-1
zpe.correction: 0.096893 hartree
zpe.thermalcorrener: 0.105628 hartree
zpe.thermalcorrenthalpy: 0.106572 hartree
zpe.thermalcorrgfe: 0.061960 hartree
zpe.sumelectzpe: -1297.978236 hartree
zpe.sumelectthermal: -1297.969501 hartree
zpe.sumelectthermalent: -1297.968557 hartree
zpe.sumelectthermalfe: -1298.013169 hartree
dipole: 2.2175 0.2819 0.0000
dipole: 2.2353
quadrupole: -69.2814 -76.8720 -79.6191
quadrupole: -4.1190 -0.0001 0.0001
quadrupole: 5.9761 -1.6145 -4.3616 -4.1190 -0.0001 0.0001
hfenergy: -1298.0751291 hartree
pointgroup: C01 [X(C7H4Cl2N2)]
dipole: 0.876659 0.0699433 -0.0000069 debye
dipolederiv: -0.3042722 0.2586933 0.0000063 0.3383902 -0.508974 -0.0000097 0.0000073 -0.0000089 0.0336862 -0.7179659 -0.2182512 0.0000034 -0.3604494 -0.2614453 0.0000011 0.0000018 0. -0.0712497 -0.821117 -0.0249617 0.000006 -0.1032319 0.2178341 0.0000052 0.000006 0.0000047 -0.1456237 -0.1999376 0.1408853 0.0000015 -0.1846219 -0.4335569 -0.0000012 -0.0000027 -0.0000045 -0.1860837 -0.1039959 0.1074354 0.0000025 0.1473667 -0.273149 -0.0000053 0.0000027 -0.0000048 0.0667496 0.1735078 -0.0333336 -0.0000015 0.120821 -0.0727238 -0.000002 0.0000003 -0.0000005 0.0007234 0.7791746 -0.4877939 -0.0000142 -0.3492363 0.7243251 0.0000132 -0.0000124 0.0000144 -0.1089646 -0.0957335 -0.1172515 -0.0000014 -0.0219488 -0.0797922 0.0000005 -0.0000005 0.0000015 -0.115107 0.1430197 -0.0156433 -0.0000026 -0.0574731 0.0802465 0.000003 -0.0000027 0.0000031 -0.1286179 0.9268195 0.456264 -0.0000038 0.6009013 0.3755137 -0.0000005 -0.0000022 0.0000007 -0.0704413 -0.2388737 -0.1803926 -0.000001 -0.2187992 -0.0174635 0.000003 -0.0000015 0.0000025 -0.1215426 0.0864442 0.0134483 0.000001 -0.0292951 -0.0006509 -0.0000017 0.0000005 -0.0000021 0.1811657 0.0706304 -0.0150919 0.0000007 0.0243263 -0.0454134 -0.0000026 0.000001 -0.0000025 0.1665938 0.3212231 0.0433392 0.0000006 0.0487604 0.2211331 -0.0000018 0.0000002 -0.0000017 0.3324699 -0.0189235 0.0726541 0.0000024 0.0444898 0.0741166 -0.0000014 0.0000022 -0.0000016 0.166242 unknown
polarizability: 158.6347222|-2.765636|119.1430096|-0.001095|0.0009258|40.2642875 unknown
InChI: InChI=1S/C7H4Cl2N2/c8-4-1-2-6-5(3-4)7(9)11-10-6/h1-3,11H
charge 0 multiplicity 1
15 atoms
Cl 2.636761 -2.235373 -0.000067
Cl -3.567947 -1.323488 0.000001
N  2.462731 0.533609 -0.000032
N  1.641252 1.651471 -0.000011
C  0.408201 -0.362114 -0.000023
C  0.372152 1.092135 -0.000007
C  1.785707 -0.666429 -0.00004
C  -0.791651 -1.133706 -0.000021
C  -0.87774 1.780336 0.000011
C  -1.983767 -0.416189 -0.000003
C  -2.048085 1.019464 0.000013
H  -0.77558 -2.2270 -0.000033
H  -0.910536 2.87354 0.000024
H  3.473841 0.665043 -0.000039
H  -3.027938 1.506104 0.000027
