program: Gaussian 09
title: 000268497
version: EM64L-G09RevD.01
frameworkgroup: C1[X(C15H21NO4)]
method: RPBEPBE
basis: SDD
operation: Freq
keyword: #p
keyword: freq=noraman
keyword: PBEPBE/SDD
title: #p freq=noraman PBEPBE/SDD
converged: YES YES NO NO
title: Mulliken charges:
elementType: O O O O N C C C C C C C C C C C C C C C H H H H H H H H H H H H H H H H H H H H H
charge: -0.463377 -0.441184 -0.303306 -0.256985 -0.348275 0.353458 -0.224627 -0.429341 -0.733095 -0.809875 0.147989 -0.410784 -0.511933 0.151569 0.287388 -0.337967 -0.344221 -0.241794 -0.224902 -0.218050 0.229320 0.212354 0.248122 0.195329 0.237952 0.259240 0.236138 0.218687 0.222548 0.352435 0.367827 0.238556 0.260664 0.336863 0.242171 0.262007 0.248140 0.278395 0.235969 0.238094 0.238499
chargesum: 0.00000
title: Mulliken charges with hydrogens summed into heavy atoms:
elementType: O O O O N C C C C C C C C C C C C C C C
charge: -0.095550 -0.104322 -0.303306 -0.256985 0.004161 0.353458 0.004692 0.031135 -0.040574 -0.132502 0.147989 0.088437 -0.007755 0.151569 0.287388 -0.089827 -0.065825 -0.005824 0.013192 0.020449
polarizability: 2.22098386e+02 2.75017142e+01 1.54731564e+02 9.55468356e+00 -1.31703225e+01 1.63119324e+02
1716.lowfreq: -26.8442 -10.6331 -2.1196 -0.0005 0.0004 0.0009 4.6730 18.6314 33.4680
frequency: -22.1046 18.0159 33.4115 34.9703 62.0828 81.2452 94.2034 111.9653 134.6145 154.3093 171.2630 182.6624 227.5672 233.8152 240.5548 263.5995 278.6798 300.0209 311.6699 322.3434 334.3191 358.3256 384.6133 397.6425 399.5201 412.8982 432.5032 466.2643 485.2953 534.1996 565.2489 574.6674 613.3953 635.8435 655.8622 688.1881 695.7108 711.7608 749.4157 759.0979 773.8320 852.5179 859.4507 875.1397 904.0626 923.2860 940.7963 946.5453 965.0171 971.3065 980.1429 989.7473 993.3125 994.7010 1007.0738 1011.9865 1021.3149 1027.3327 1046.6311 1087.1890 1101.3634 1105.7735 1175.2112 1177.7483 1185.9386 1190.7640 1194.3526 1208.1763 1227.3673 1239.2504 1256.9583 1279.1287 1313.2156 1315.4416 1331.0020 1342.9001 1358.3505 1368.5126 1370.1673 1378.4350 1389.1479 1391.1971 1423.2910 1436.8430 1448.3784 1464.3638 1466.9070 1469.6984 1480.3057 1485.0016 1493.7408 1495.6791 1561.2053 1595.0456 1597.5161 1610.7568 2958.5059 2967.8826 2977.5815 2981.4788 2982.1956 3017.9079 3039.2681 3058.0664 3066.6734 3074.7740 3093.6251 3095.9944 3102.7368 3132.6981 3141.5103 3152.1282 3161.4299 3172.0803 3370.0828 3534.0580 3564.3245
redmass: 4.5656 5.2329 4.1844 5.1686 4.8218 6.2192 3.3938 3.5884 4.7841 5.0741 4.4119 4.0522 3.3494 1.5579 1.7176 1.2312 3.1523 2.1027 3.1587 1.4525 2.7048 4.5877 2.9947 2.6510 2.8181 2.9487 2.9672 5.2326 2.9557 1.1898 2.7867 4.2279 6.4055 2.8012 4.5303 1.3093 1.7758 3.2376 3.6800 4.5492 1.8581 3.0263 1.2885 2.5138 1.6576 2.3294 1.3698 1.5588 3.2714 2.1720 4.2341 6.2053 1.3918 2.3607 2.0232 1.3877 2.1001 2.0254 2.4987 1.5982 1.6294 2.4535 1.0746 1.6378 1.2080 1.1479 2.3435 1.6369 1.5544 2.1949 2.1697 1.5291 1.5552 1.3658 1.2315 1.6729 1.2168 1.3142 1.2023 1.3003 8.9773 1.2160 1.1239 2.2079 1.1073 1.0680 1.0756 1.0593 2.1521 1.7776 1.0598 1.1708 6.5122 6.4923 6.2713 6.1433 1.0677 1.0368 1.0740 1.0469 1.0606 1.0671 1.0926 1.0981 1.0987 1.0978 1.1026 1.0952 1.0996 1.0853 1.0880 1.0924 1.0963 1.1015 1.0642 1.0778 1.0662
irintensity: 2.0658 0.4851 0.4988 2.2651 1.7880 0.8222 6.4372 4.6068 0.5105 1.1893 5.3189 4.2541 2.7665 1.9586 9.0853 18.0809 11.2017 6.9792 21.7073 60.0565 21.0135 39.5306 8.1910 2.1065 0.0833 0.9767 14.7523 5.3242 7.4495 126.7651 5.1874 10.7893 0.3234 60.9032 2.4820 112.6985 44.3582 10.9314 16.1748 2.7299 58.3397 0.7620 0.0594 25.9992 11.1912 4.5585 8.8818 4.6034 50.4358 14.4279 79.2048 4.5320 0.9204 75.8423 4.5953 0.6862 22.3736 1.9514 0.2246 12.7214 13.7868 23.6693 9.0426 1.7815 63.6895 4.2219 17.3320 47.2086 20.0806 125.7259 46.4736 61.2705 11.2936 1.7145 14.1219 95.2365 8.7127 12.8766 12.3579 184.9766 4.2645 14.4369 31.1308 29.3939 38.2100 6.3048 19.8486 7.3211 35.2324 131.1419 21.0513 35.9619 113.9707 28.8801 160.6021 10.2721 52.2632 30.9432 18.1711 44.7901 19.8490 16.9976 29.3066 25.2649 37.4778 28.8961 2.0937 14.4504 12.5862 0.2667 4.3440 13.9596 17.6145 19.5205 67.5509 59.3358 5.6034
temp: 298.150 k
press: 1.00000 atm
elementType: 8 8 8 8 7 6 6 6 6 6 6 6 6 6 6 6 6 6 6 6 1 1 1 1 1 1 1 1 1 1 1 1 1 1 1 1 1 1 1 1 1
symmnumber: 1
zpe: 884383.0 jmol-1
zpe.correction: 0.336844 hartree
zpe.thermalcorrener: 0.357032 hartree
zpe.thermalcorrenthalpy: 0.357977 hartree
zpe.thermalcorrgfe: 0.287044 hartree
zpe.sumelectzpe: -938.318203 hartree
zpe.sumelectthermal: -938.298014 hartree
zpe.sumelectthermalent: -938.297070 hartree
zpe.sumelectthermalfe: -938.368003 hartree
dipole: 8.1272 -0.1280 -0.5181
dipole: 8.1447
quadrupole: -125.1698 -123.0373 -120.5508
quadrupole: 5.4948 12.2865 -4.5674
quadrupole: -2.2505 -0.1180 2.3685 5.4948 12.2865 -4.5674
hfenergy: -938.6550463 hartree
pointgroup: C01 [X(C15H21N1O4)]
dipole: -3.1992199 0.1022896 -0.1500758 debye
polarizability: 222.3747428|28.1157744|150.9858807|-6.5483838|11.2661883|166.5886502 unknown
InChI: InChI=1S/C15H21NO4/c1-15(2,10-17)13(19)14(20)16-9-8-12(18)11-6-4-3-5-7-11/h3-7,13,16-17,19H,8-10H2,1-2H3
charge 0 multiplicity 1
41 atoms
O  4.665118 0.725644 0.144006
O  2.749252 -3.053074 1.038846
O  2.614287 1.74445 1.465699
O  -1.331947 0.948448 -1.559888
N  1.156653 1.640278 -0.345216
C  3.07686 -1.080801 -0.500295
C  3.368957 0.467402 -0.47686
C  3.057771 -1.61479 0.961464
C  4.227647 -1.762095 -1.284292
C  1.728698 -1.38766 -1.201544
C  2.328094 1.325604 0.290505
C  0.114119 2.471789 0.276616
C  -1.100856 1.651577 0.757932
C  -1.812227 0.914826 -0.382865
C  -3.069941 0.154543 -0.091932
C  -3.615869 0.061407 1.218112
C  -3.732441 -0.499236 -1.168042
C  -4.799589 -0.671778 1.445365
C  -4.914992 -1.228708 -0.939947
C  -5.451544 -1.316902 0.368185
H  3.42415 0.814747 -1.528858
H  2.343873 -1.030498 1.580469
H  4.062497 -1.522979 1.402395
H  4.161459 -1.536578 -2.36585
H  4.170339 -2.856816 -1.148801
H  5.203859 -1.407142 -0.913657
H  1.654786 -2.468749 -1.41952
H  1.655984 -0.868559 -2.17654
H  0.851625 -1.095893 -0.593502
H  0.935044 1.257308 -1.267784
H  4.458661 1.158384 1.024803
H  -0.216052 3.226375 -0.459732
H  0.577648 2.987681 1.133826
H  1.797218 -3.190511 0.803985
H  -1.820777 2.327052 1.26193
H  -0.778731 0.917305 1.522984
H  -3.121818 0.553849 2.062144
H  -3.297084 -0.416993 -2.169424
H  -5.213772 -0.74179 2.456791
H  -5.420221 -1.728195 -1.773489
H  -6.37124 -1.885025 0.546581
