program: Gaussian 09
title: 000268517
version: EM64L-G09RevD.01
frameworkgroup: C1[X(C24H18S2)]
method: RPBEPBE
basis: SDD
operation: Freq
keyword: #pfreq=noraman
keyword: PBEPBE/SDD
title: #p freq=noraman PBEPBE/SDD
converged: YES YES NO NO
title: Mulliken charges:
elementType: S S C C C C C C C C C C C C C C C C C C C C C C C C H H H H H H H H H H H H H H H H H H
charge: 0.060741 0.060726 0.414897 0.415025 0.307775 0.307783 -0.469380 -0.469502 -0.383034 -0.383029 -0.161254 -0.161195 -0.403544 -0.403539 -0.353384 -0.353464 -0.233913 -0.233956 -0.245545 -0.245586 -0.233639 -0.233658 -0.230750 -0.230871 -0.247549 -0.247476 0.255219 0.255229 0.261797 0.261801 0.245380 0.245394 0.263890 0.263895 0.232460 0.232458 0.237141 0.237143 0.225698 0.225703 0.228895 0.228871 0.228174 0.228173
chargesum: 0.00000
title: Mulliken charges with hydrogens summed into heavy atoms:
elementType: S S C C C C C C C C C C C C C C C C C C C C C C C C
charge: 0.060741 0.060726 0.414897 0.415025 0.307775 0.307783 -0.469380 -0.469502 -0.127815 -0.127800 0.100543 0.100607 -0.158164 -0.158145 -0.089495 -0.089569 -0.001453 -0.001497 -0.008404 -0.008443 -0.007941 -0.007955 -0.001855 -0.002000 -0.019376 -0.019303
polarizability: 3.24191417e+02 -6.66792751e+00 3.69001725e+02 3.50731710e-03 -8.85767024e-03 2.04123767e+02
1716.lowfreq: -9.3689 -8.6901 -0.0011 -0.0009 0.0008 5.0338 6.5702 21.1358 33.3211
frequency: 6.2078 21.0197 33.3206 44.0240 55.7119 63.4577 70.2489 81.0166 97.8761 99.1502 109.4862 164.0368 209.4334 213.5449 214.2048 275.1304 276.4961 305.0217 305.5815 356.1064 381.2990 397.6686 405.4803 405.7693 407.7323 408.2314 479.8060 480.8275 521.3579 523.0485 552.5745 553.3349 608.0863 608.1455 615.3222 615.4365 661.3264 661.7552 702.9383 704.5113 732.7444 733.4744 745.4382 746.1534 758.3616 758.9203 777.0650 778.8860 850.6536 851.6656 875.1212 876.1651 920.7872 921.9226 956.7426 957.3423 974.6741 975.4877 987.8335 987.8756 991.2458 991.5137 992.0767 992.2077 994.5759 994.9777 1014.8356 1017.7619 1032.8305 1033.1345 1063.4017 1064.5367 1080.2140 1081.8113 1119.8428 1120.6513 1171.5125 1171.6921 1173.4109 1173.4919 1191.2893 1192.5186 1247.1775 1247.8813 1282.9878 1283.2321 1315.0206 1317.4321 1352.5137 1352.8978 1372.2166 1372.2368 1410.7695 1411.2124 1433.5051 1434.1981 1449.7873 1449.8047 1489.1733 1489.8623 1555.9712 1556.4520 1583.9133 1584.2357 1591.1396 1591.2735 1610.2585 1610.4893 3122.0685 3122.1004 3128.6046 3128.6302 3130.7847 3130.9138 3140.5199 3140.6468 3143.7273 3143.8007 3153.3543 3153.4074 3158.1102 3158.2468 3167.7544 3167.8243 3171.1891 3171.3454
redmass: 5.9210 5.1401 5.6264 4.8475 4.2524 5.1034 5.2681 4.6174 4.9086 6.0733 5.4126 4.7006 6.5376 6.6274 7.2943 5.6124 5.6269 5.1575 5.2301 7.8637 4.1852 5.9331 2.8622 2.9528 7.4713 8.0923 4.0361 3.8879 4.0129 4.0230 3.2188 3.2284 6.9403 6.9221 6.3776 6.3925 6.6161 6.5847 1.7870 1.7858 3.3071 3.2946 5.6783 5.6497 1.4408 1.4297 1.7317 1.7038 1.2423 1.2479 1.3682 1.3639 1.4044 1.3996 1.3939 1.3946 1.4075 1.3987 5.2862 5.0145 1.3626 1.8406 6.9650 3.1081 1.3221 1.3207 6.3096 5.9125 2.1635 2.1724 1.8430 1.8692 1.6402 1.6515 1.7103 1.7055 1.0524 1.0530 1.0637 1.0630 1.1152 1.1159 1.5627 1.5675 2.2877 2.2874 1.4024 1.3976 5.6766 5.6167 6.2550 6.1376 2.2062 2.2006 2.2887 2.2941 2.2562 2.2534 2.6437 2.6219 5.8357 5.8637 6.0745 6.0360 6.2046 6.2092 6.1443 6.1451 1.0849 1.0849 1.0856 1.0856 1.0880 1.0880 1.0898 1.0897 1.0934 1.0933 1.0948 1.0947 1.0973 1.0973 1.1007 1.1007 1.0984 1.0982
irintensity: 0.0024 0.1291 0.1407 0.0050 0.0335 0.0389 0.1010 1.6510 1.0244 1.6232 1.8479 1.2955 2.2030 0.6545 0.1012 0.0096 1.4031 0.7676 0.7887 0.0404 0.6665 0.0351 0.5126 0.3075 2.2503 5.1374 12.6650 19.8046 3.0182 1.4976 3.4170 4.4388 0.9184 7.4138 0.5086 0.0739 1.7810 2.9212 4.2965 73.9603 41.4759 5.6476 1.6286 1.1915 88.2959 72.1437 33.9103 5.0967 2.4384 1.0309 1.0531 0.0732 1.0710 0.6928 1.2267 0.1593 0.7132 0.1507 2.2932 0.3676 0.2162 1.2478 13.5294 3.4932 0.4726 0.0913 0.3587 4.8062 3.0843 0.2038 0.2305 12.7057 12.3886 0.6670 3.0458 0.1935 0.6811 0.0256 0.8889 0.0173 2.3503 0.0676 1.9352 0.7392 7.9521 4.9802 0.5850 0.2738 0.8988 2.1636 0.3377 0.2908 6.2313 7.9439 9.1045 0.9539 66.0483 12.7260 1.9165 0.2567 1.7647 3.2053 0.9192 0.0010 8.5984 0.1266 0.0018 0.1180 0.7225 2.8675 0.3062 3.6539 6.9782 1.9879 3.6264 14.5966 41.8365 1.0192 13.3695 15.2447 73.9245 6.8620 43.1045 1.6589 1.5302 6.0906
temp: 298.150 k
press: 1.00000 atm
elementType: 16 16 6 6 6 6 6 6 6 6 6 6 6 6 6 6 6 6 6 6 6 6 6 6 6 6 1 1 1 1 1 1 1 1 1 1 1 1 1 1 1 1 1 1
symmnumber: 1
zpe: 888533.8 jmol-1
zpe.correction: 0.338425 hartree
zpe.thermalcorrener: 0.360882 hartree
zpe.thermalcorrenthalpy: 0.361826 hartree
zpe.thermalcorrgfe: 0.282857 hartree
zpe.sumelectzpe: -1719.709954 hartree
zpe.sumelectthermal: -1719.687497 hartree
zpe.sumelectthermalent: -1719.686553 hartree
zpe.sumelectthermalfe: -1719.765522 hartree
dipole: 0.0007 -0.0002 -2.7259
dipole: 2.7259
quadrupole: -154.5841 -138.2975 -172.1161
quadrupole: 0.5983 0.0005 -0.0047
quadrupole: 0.4151 16.7017 -17.1169 0.5983 0.0005 -0.0047
hfenergy: -1720.0483788 hartree
pointgroup: C01 [X(C24H18S2)]
dipole: 0.0027298 0.0032325 -1.0724542 debye
polarizability: 328.8454254|-15.2121878|364.3455532|0.2986064|0.4425335|204.1259301 unknown
InChI: InChI=1S/C24H18S2/c1-3-11-19(12-4-1)21-15-7-9-17-23(21)25-26-24-18-10-8-16-22(24)20-13-5-2-6-14-20/h1-18H
charge 0 multiplicity 1
44 atoms
S  -1.08242 -0.452545 2.491705
S  1.06738 0.434158 2.500114
C  -1.811882 -1.782361 0.059563
C  1.80993 1.780473 0.081321
C  -2.717767 -0.659503 -0.337369
C  2.718991 0.660867 -0.317623
C  -0.989806 -1.79317 1.230919
C  0.98103 1.783122 1.24792
C  -1.767341 -2.933599 -0.780092
C  1.769494 2.937113 -0.75108
C  -0.157743 -2.905855 1.519406
C  0.146473 2.8933 1.538736
C  -4.064183 -0.938231 -0.698119
C  4.067175 0.943159 -0.668885
C  -2.256446 0.680965 -0.425332
C  2.259437 -0.679425 -0.416624
C  -0.931812 -4.032701 -0.497651
C  0.931542 4.033793 -0.466385
C  -0.112533 -4.018406 0.656069
C  0.105522 4.0114 0.682377
C  -4.928833 0.09402 -1.12415
C  4.935203 -0.085521 -1.096682
C  -3.117998 1.711621 -0.857149
C  3.124398 -1.706466 -0.850261
C  -4.458409 1.424734 -1.206098
C  4.466467 -1.416074 -1.189899
H  -2.380333 -2.937051 -1.688195
H  2.387844 2.94693 -1.655495
H  0.450113 -2.88596 2.429513
H  -0.466702 2.867092 2.445111
H  -4.440223 -1.964976 -0.61862
H  4.441736 1.969733 -0.580673
H  -1.220452 0.916956 -0.167088
H  1.222314 -0.918058 -0.165417
H  -0.915401 -4.892287 -1.176739
H  0.918492 4.8978 -1.139914
H  0.538464 -4.867663 0.889599
H  -0.54748 4.858657 0.917581
H  -5.966948 -0.139608 -1.385951
H  5.974562 0.150733 -1.351091
H  -2.737111 2.736953 -0.923651
H  2.74492 -2.731722 -0.925433
H  -5.126921 2.227232 -1.537669
H  5.137558 -2.215826 -1.522896
