program: Gaussian 09
title: 000268439
version: EM64L-G09RevD.01
frameworkgroup: C1[X(C10H10O)]
method: RPBEPBE
basis: SDD
operation: Freq
keyword: #pfreq=noraman
keyword: PBEPBE/SDD
title: #p freq=noraman PBEPBE/SDD
converged: NO YES NO NO
title: Mulliken charges:
elementType: O C C C C C C C C C C H H H H H H H H H H
charge: -0.257916 0.351700 -0.516446 0.108387 -0.532999 0.450583 -0.350355 -0.383165 -0.200337 -0.173845 -0.812888 0.230305 0.230233 0.233702 0.252272 0.234331 0.214988 0.238599 0.234611 0.224173 0.224067
chargesum: 0.00000
title: Mulliken charges with hydrogens summed into heavy atoms:
elementType: O C C C C C C C C C C
charge: -0.257916 0.351700 -0.055908 0.108387 -0.299297 0.450583 -0.098083 -0.148834 0.014651 0.064754 -0.130038
polarizability: 1.46572253e+02 -3.60433726e+00 1.15759386e+02 -3.99773764e-01 -9.15035316e-02 5.28502752e+01
1716.lowfreq: -15.9190 -12.6982 -0.0008 -0.0007 -0.0005 1.9433 21.5218 68.5057 142.7045
frequency: 20.1779 68.4589 142.7015 184.3982 253.8205 333.8931 394.7980 426.6263 431.4361 461.2536 499.6500 549.4747 570.5029 690.9534 709.0085 725.6652 735.7180 822.4347 856.6481 885.0377 903.1513 918.9223 947.7072 951.8890 981.1889 1001.3764 1020.2191 1047.1011 1113.8636 1153.3022 1186.0564 1192.4527 1229.3969 1263.9285 1265.5398 1323.9976 1360.6863 1377.9804 1398.1148 1420.6876 1459.4913 1473.0883 1476.1075 1492.2253 1596.0016 1627.9367 1675.0414 2942.1417 2971.8829 2972.6082 3053.2962 3082.3568 3105.7785 3128.5597 3153.9851 3165.2234 3201.9685
redmass: 1.0207 2.7242 4.5790 2.8944 3.0687 3.7983 3.8782 4.6460 2.7346 3.4224 6.4248 2.9983 6.3132 5.0984 2.3692 5.8217 1.5310 1.3719 6.0337 1.3084 3.7087 1.2377 2.9849 1.3733 1.8335 1.5046 2.4645 1.5445 2.0441 1.5233 1.5657 1.0868 1.7276 1.5603 2.9608 1.7173 1.4324 6.2842 1.2231 3.4332 1.1549 1.0527 1.1504 2.5420 6.6592 7.0260 6.4040 1.0590 1.1002 1.0388 1.0950 1.0996 1.0912 1.0895 1.0872 1.0954 1.1005
irintensity: 0.5421 0.6206 0.3523 5.1796 1.2150 0.0383 2.0864 2.7837 18.6099 6.7030 0.6328 1.8477 1.3848 4.5406 16.0522 6.4351 36.7071 51.2323 3.1065 9.1905 5.3832 0.1474 11.7872 2.0578 0.0460 12.7625 47.5761 15.5824 65.8428 31.9770 13.8935 0.9757 86.2343 6.9630 59.1711 10.2049 0.7735 3.6109 8.3516 4.9688 4.5901 12.7944 14.5014 117.3227 7.6230 0.3051 64.0827 47.3561 24.1504 41.8238 23.8219 17.2311 18.3940 16.6507 7.3283 7.0865 26.3394
temp: 298.150 k
press: 1.00000 atm
elementType: 8 6 6 6 6 6 6 6 6 6 6 1 1 1 1 1 1 1 1 1 1
symmnumber: 1
zpe: 444998.3 jmol-1
zpe.correction: 0.169491 hartree
zpe.thermalcorrener: 0.178991 hartree
zpe.thermalcorrenthalpy: 0.179936 hartree
zpe.thermalcorrgfe: 0.133502 hartree
zpe.sumelectzpe: -461.482281 hartree
zpe.sumelectthermal: -461.472781 hartree
zpe.sumelectthermalent: -461.471837 hartree
zpe.sumelectthermalfe: -461.518270 hartree
dipole: -0.5741 -1.5880 0.0503
dipole: 1.6894
quadrupole: -55.3585 -59.8733 -68.8966
quadrupole: -2.7040 -0.1628 -0.0329
quadrupole: 6.0176 1.5028 -7.5204 -2.7040 -0.1628 -0.0329
hfenergy: -461.6517724 hartree
pointgroup: C01 [X(C10H10O1)]
dipole: 0.2160401 0.6282808 0.0187536 debye
dipolederiv: -1.7338593 0.3294972 0.0006233 -0.0029581 -0.5368178 0.0013427 0.0060817 0.0007208 -0.1675575 -0.070415 -0.027263 0.0004729 -0.342567 0.0239381 -0.0030069 -0.0065168 -0.003824 -0.0510695 -0.022973 0.0333069 0.0005854 0.0203397 0.0702087 0.0009324 0.0028849 0.002554 0.2848475 1.1475502 0.0721356 -0.0058937 0.5395921 -0.011265 -0.0016867 -0.007759 -0.000119 0.0558278 -0.1470922 -0.0397178 -0.0000136 0.0819106 0.1035643 0.0061369 -0.0072304 0.0036965 -0.1815547 0.2707771 0.1455094 0.0141318 0.1538865 -0.0648871 0.0052258 0.0886788 0.0208186 -0.0362779 -0.2362851 -0.0512127 -0.0011294 0.0896208 0.0791939 0.0047463 -0.0076228 0.0013629 -0.1481712 -0.01548 -0.0042025 0.0029822 -0.1608877 0.0637277 -0.0055811 -0.0034584 -0.0077815 -0.1846766 0.0426755 -0.0205194 -0.0007891 0.2934648 -0.2154883 -0.0008909 -0.002177 -0.0006696 -0.3171935 0.9231418 -0.3900646 -0.0002096 -0.7010151 0.6037222 -0.0024428 -0.0007443 -0.0013004 -0.079054 -0.0896801 -0.0589734 -0.0053912 -0.0639804 0.0585315 -0.0021701 -0.1072204 -0.0245459 0.0744237 0.0270766 -0.0394381 -0.0198252 0.0208879 -0.0516516 -0.1050897 0.0101881 -0.155351 -0.0410608 0.027737 -0.038636 0.0206064 0.0205914 -0.0494795 0.1050354 -0.0106035 0.1556576 -0.0433207 0.0720713 -0.0196674 0.003525 -0.0471339 -0.1093258 0.0005572 0.0045335 0.0047842 0.1403553 0.0885057 -0.0507314 0.0011801 -0.0348712 -0.0550373 -0.0004474 0.003794 -0.0009427 0.1680824 -0.0586878 0.1141333 0.0029159 0.0991961 0.0112236 0.0021841 0.0070276 -0.0018233 0.1526293 -0.1084899 0.0690271 0.0006022 0.1047592 0.0476133 0.0003337 0.000468 0.0004217 0.1727865 -0.0851311 -0.0424194 0.0010206 -0.0692991 0.046109 0.0008547 0.0013264 0.0006063 0.1894036 -0.0353438 -0.0421256 -0.0547624 -0.0572849 0.0945674 -0.0273919 -0.1167057 -0.0439556 -0.1043632 -0.0438874 0.0419598 0.0541315 0.126929 -0.015593 -0.083914 0.0973201 -0.0507593 0.0627984 0.0477893 0.0194019 -0.014763 -0.0711807 -0.0928544 0.105272 0.0477354 0.1004497 0.0531452 unknown
polarizability: 146.6790298|-3.1173833|115.6537629|0.2577143|0.0314745|52.8491214 unknown
InChI: InChI=1S/C10H10O/c1-8-4-5-10-9(7-8)3-2-6-11-10/h2,4-7H,3H2,1H3
charge 0 multiplicity 1
21 atoms
O  -1.762433 -1.330268 0.010065
C  -0.24991 0.650705 -0.002886
C  -1.419403 1.633045 -0.003806
C  -0.465186 -0.749616 0.002977
C  1.088607 1.106951 -0.013047
C  2.19571 0.22316 -0.014015
C  0.611263 -1.659527 -0.002597
C  1.933166 -1.17205 -0.012677
C  -2.752413 0.910478 0.003393
C  -2.857137 -0.439866 0.009855
C  3.620164 0.751457 0.006953
H  -1.347365 2.306383 0.876422
H  -1.352448 2.298676 -0.890287
H  1.270424 2.190435 -0.021052
H  0.395831 -2.732411 -0.003669
H  2.769138 -1.8815 -0.020436
H  -3.674711 1.500113 0.003501
H  -3.795388 -0.998092 0.015366
H  3.974565 0.908981 1.044534
H  4.31951 0.044709 -0.47369
H  3.701317 1.720136 -0.517506
