program: Gaussian 09
title: 000268475
version: EM64L-G09RevD.01
frameworkgroup: C1[X(C13H17NO2)]
method: RPBEPBE
basis: SDD
operation: Freq
keyword: #p
keyword: freq=noraman
keyword: PBEPBE/SDD
title: #p freq=noraman PBEPBE/SDD
converged: YES YES NO NO
title: Mulliken charges:
elementType: O O N C C C C C C C C C C C C C H H H H H H H H H H H H H H H H H
charge: -0.240680 -0.240893 -0.189954 -0.357812 -0.365238 -0.306538 -0.316544 0.481307 -0.388614 -0.383560 0.309335 -0.368819 -0.378376 0.113070 -0.480572 -0.687630 0.215130 0.228831 0.223915 0.220600 0.222457 0.197028 0.195370 0.224212 0.225902 0.217672 0.239019 0.273921 0.225447 0.227261 0.229531 0.204719 0.230503
chargesum: 0.00000
title: Mulliken charges with hydrogens summed into heavy atoms:
elementType: O O N C C C C C C C C C C C C C
charge: -0.240680 -0.240893 -0.189954 0.086149 0.079278 0.112947 0.103037 0.481307 -0.162712 -0.165888 0.309335 -0.129800 -0.104455 0.113070 -0.027864 -0.022876
polarizability: 2.71423374e+02 4.98132115e+00 1.46401731e+02 -3.85705384e+00 -2.88903141e+00 8.99445081e+01
1716.lowfreq: -9.6606 -0.0006 -0.0004 0.0007 1.6000 7.0989 34.0753 38.3872 58.8183
frequency: 33.6047 38.3528 58.7458 76.1727 84.6255 111.6804 172.3188 192.0188 220.5086 229.5564 237.4018 289.5097 300.8870 377.3240 385.3928 411.4354 428.3326 455.4460 475.0547 498.2485 532.6086 565.3740 619.1666 630.7322 686.7323 732.1507 753.5177 795.8008 801.6662 815.5175 832.4208 841.1356 911.4348 915.8669 947.2150 950.9934 990.9073 997.8890 1016.5223 1018.6922 1042.5266 1053.4784 1067.2465 1081.9446 1092.0270 1103.1626 1128.6391 1171.5922 1197.6697 1204.4079 1228.7726 1247.4730 1255.2444 1260.1780 1284.7872 1312.4976 1333.8480 1336.7955 1347.3224 1362.8735 1370.8898 1373.8716 1382.9985 1394.2780 1439.0469 1441.3784 1447.1650 1450.6785 1454.5917 1461.6417 1467.2884 1477.8990 1516.5572 1544.5130 1582.2884 1626.4673 2928.2871 2936.3317 2953.9555 2959.4801 2965.5664 2995.5948 3012.2242 3065.5696 3084.6444 3088.6567 3090.8394 3098.0995 3100.5447 3136.5368 3140.9562 3160.7477 3166.5435
redmass: 4.4130 3.6997 2.5661 4.4527 2.2628 4.1431 2.1810 1.6025 3.5525 2.1778 3.6942 4.0727 3.8328 2.7252 2.9490 2.9408 4.8651 2.8377 3.9918 3.1444 3.2960 2.0791 2.6858 6.7321 3.2597 2.9238 4.5269 1.5537 2.4397 1.6348 1.7182 1.6408 3.5251 2.6486 3.8335 1.4461 1.3433 2.5637 2.2460 1.6292 2.3660 1.9506 1.6451 4.7831 2.6840 2.1647 1.5048 3.0140 1.1698 1.1641 1.6542 1.1865 1.7005 1.3006 1.1954 1.3677 1.9642 1.3323 1.2979 1.3439 3.2933 1.7772 1.6992 1.2112 1.1730 2.9791 1.0842 1.0953 1.1147 1.1384 1.0393 1.0537 2.8782 6.4006 7.7453 6.4040 1.0694 1.0715 1.0669 1.0668 1.0598 1.0365 1.0984 1.0917 1.0960 1.0979 1.1000 1.0896 1.0998 1.0875 1.0866 1.0950 1.0948
irintensity: 0.5333 3.1839 0.7695 1.7230 1.1864 1.4787 2.1987 1.7515 4.4987 1.8226 6.5795 25.5049 10.2927 1.3350 0.8887 1.0909 3.7088 0.4379 11.1598 6.5357 3.7871 11.5162 37.8623 0.3854 1.5280 3.1072 6.6087 54.8909 10.9065 2.8713 9.2468 16.7029 78.6774 22.5919 30.1911 2.4390 1.6565 1.1273 10.3495 29.2622 13.7256 15.6494 1.5098 50.1250 2.1042 19.3190 6.3277 16.7875 149.2571 88.5125 349.8263 0.2248 10.9563 40.6319 9.8215 3.3024 52.7427 1.6616 5.6656 6.4404 76.6891 10.1459 82.7871 35.6230 39.7504 27.6547 4.4145 2.3604 22.6755 20.2851 11.0684 18.4194 51.6366 135.6694 239.7683 274.7212 56.9166 70.1952 31.7601 109.4385 34.1856 38.9394 12.7445 21.5524 35.2515 41.0875 30.0282 14.1051 33.1241 13.2333 5.3587 24.7185 12.7550
temp: 298.150 k
press: 1.00000 atm
elementType: 8 8 7 6 6 6 6 6 6 6 6 6 6 6 6 6 1 1 1 1 1 1 1 1 1 1 1 1 1 1 1 1 1
symmnumber: 1
zpe: 722912.8 jmol-1
zpe.correction: 0.275343 hartree
zpe.thermalcorrener: 0.290667 hartree
zpe.thermalcorrenthalpy: 0.291611 hartree
zpe.thermalcorrgfe: 0.231620 hartree
zpe.sumelectzpe: -709.559125 hartree
zpe.sumelectthermal: -709.543801 hartree
zpe.sumelectthermalent: -709.542857 hartree
zpe.sumelectthermalfe: -709.602848 hartree
dipole: -3.5139 -2.6119 0.1324
dipole: 4.3803
quadrupole: -113.8441 -87.9569 -97.1040
quadrupole: -13.7548 3.0781 0.7423
quadrupole: -14.2091 11.6781 2.5310 -13.7548 3.0781 0.7423
hfenergy: -709.834468 hartree
pointgroup: C01 [X(C13H17N1O2)]
dipole: -1.3902744 -1.0146017 -0.0871345 debye
polarizability: 271.5627279|4.2504326|146.2229966|-0.6542913|3.783814|89.9838888 unknown
InChI: InChI=1S/C13H17NO2/c1-2-13(15)11-3-5-12(6-4-11)14-7-9-16-10-8-14/h3-6H,2,7-10H2,1H3
charge 0 multiplicity 1
33 atoms
O  -5.112798 -0.146925 -0.004803
O  4.123056 1.429012 0.090431
N  -2.211102 -0.031832 0.069304
C  -3.044255 1.028066 0.689093
C  -2.914294 -1.329293 -0.029391
C  -4.404356 1.142298 -0.018618
C  -4.291877 -1.148987 -0.697509
C  -0.805344 0.027683 0.105148
C  -0.004086 -1.159112 0.101712
C  -0.114036 1.28445 0.112433
C  2.080128 0.158883 0.090373
C  1.399025 -1.088163 0.089539
C  1.283867 1.339672 0.10424
C  3.567012 0.286439 0.077654
C  4.415679 -0.994221 0.045986
C  5.928808 -0.717898 0.044152
H  -2.530435 1.999788 0.64159
H  -3.215233 0.787316 1.762044
H  -3.04305 -1.788355 0.976628
H  -2.326885 -2.023572 -0.653767
H  -5.062351 1.849226 0.512407
H  -4.259829 1.480611 -1.067558
H  -4.152069 -0.847995 -1.758694
H  -4.86665 -2.08853 -0.653716
H  -0.474484 -2.145408 0.138477
H  -0.672669 2.224803 0.094891
H  1.966253 -2.025401 0.095539
H  1.803654 2.303982 0.097671
H  4.139103 -1.62165 0.918353
H  4.129758 -1.583512 -0.849596
H  6.226733 -0.153257 0.944046
H  6.497225 -1.665165 0.015619
H  6.215499 -0.106256 -0.828179
