program: Gaussian 09
title: 000268437
version: EM64L-G09RevD.01
frameworkgroup: C1[X(C12H14O3)]
method: RPBEPBE
basis: SDD
operation: Freq
keyword: #pfreq=noraman
keyword: PBEPBE/SDD
title: #p freq=noraman PBEPBE/SDD
converged: YES YES NO NO
title: Mulliken charges:
elementType: O O O C C C C C C C C C C C C H H H H H H H H H H H H H H
charge: -0.266820 -0.233438 -0.196561 0.390371 -0.529804 0.177944 -0.553444 -0.459630 0.313016 -0.371990 -0.355883 0.106872 -0.056686 -0.791116 -0.536458 0.234092 0.242984 0.288272 0.243528 0.265817 0.241068 0.241498 0.173654 0.234448 0.235807 0.260958 0.228640 0.223215 0.249645
chargesum: 0.00000
title: Mulliken charges with hydrogens summed into heavy atoms:
elementType: O O O C C C C C C C C C C C C
charge: -0.266820 -0.233438 -0.196561 0.390371 -0.052728 0.177944 -0.265172 0.049715 0.313016 -0.130922 -0.114385 0.106872 0.116969 -0.059903 0.165042
polarizability: 1.94227304e+02 -1.42798416e+01 1.54536973e+02 5.25796688e+00 6.62574996e+00 8.54345833e+01
1716.lowfreq: -9.5588 -5.8416 -0.0009 -0.0007 0.0007 5.9375 32.3177 50.3724 56.9454
frequency: 32.3029 50.3675 56.8894 74.3764 96.1012 137.3478 140.6705 146.4913 169.5154 182.7851 210.5491 226.7734 256.7449 301.1383 321.2909 337.5072 441.0586 472.1463 504.4971 517.0132 542.7296 580.4561 638.8033 658.2876 664.8193 685.8797 744.6679 765.3493 812.0448 843.5810 886.8858 897.4347 940.6709 956.9118 964.0204 983.0462 1025.2453 1028.9601 1072.3021 1081.3546 1111.9933 1132.6636 1150.8753 1162.3495 1195.9846 1231.2176 1253.8898 1266.7098 1275.3928 1297.9595 1347.0396 1366.3100 1373.6601 1387.7969 1424.5225 1429.2496 1436.1065 1448.3047 1461.6546 1463.2662 1468.7305 1471.5984 1492.7066 1569.0848 1591.9852 1618.1057 1642.9993 2850.9367 2966.4728 2968.0274 2984.2895 3009.2689 3015.4107 3059.7449 3069.3829 3076.4640 3123.8422 3129.5360 3140.9884 3144.9311 3167.8411
redmass: 7.7227 3.6028 3.8470 3.3136 3.9143 4.1936 1.0658 4.9222 1.7382 5.5840 2.3403 1.7228 2.1928 3.7316 3.5894 4.2263 4.2733 3.7770 3.3063 4.0255 4.5539 4.1795 2.9339 5.3601 1.3263 3.5150 4.1264 4.0845 1.4807 1.3724 3.7687 3.1541 1.3738 1.4273 1.9390 8.6212 1.8364 1.8170 2.7820 2.0188 1.2603 2.1382 1.4511 1.3196 1.6454 2.3290 1.8844 1.4548 1.4929 1.7490 1.6028 1.2937 1.2177 5.9430 1.0881 3.6323 1.2221 1.1013 1.1430 1.0500 1.0504 1.1150 2.2950 7.1559 7.3553 6.9247 7.5133 1.0843 1.0598 1.0340 1.0374 1.0968 1.0599 1.1042 1.0971 1.1027 1.0991 1.1002 1.0915 1.0874 1.0955
irintensity: 2.1923 5.4576 4.2624 1.6848 1.6089 7.7293 2.0513 0.5374 1.6464 11.3447 2.4465 2.3798 3.4164 1.7067 2.0396 1.4456 8.4018 4.1267 1.0714 10.8742 21.7901 14.2795 5.1112 0.2459 5.8199 2.9457 3.5459 5.3892 47.3759 0.6463 4.9227 23.4191 2.4912 13.8250 21.8010 47.2024 1.4891 3.3085 0.3283 8.9933 0.1654 90.0637 1.8761 55.5361 18.9848 43.7369 204.5535 27.9956 90.1593 111.7065 9.7261 43.7175 4.1269 27.4513 36.1214 38.0794 15.7666 34.0032 27.5095 20.1342 14.4674 50.8357 41.0118 112.8754 145.4862 23.0358 150.9569 168.4502 40.4716 60.9935 4.2301 4.6330 12.0963 39.2584 14.1624 10.6762 18.9278 18.8124 4.7537 5.3071 13.5169
temp: 298.150 k
press: 1.00000 atm
elementType: 8 8 8 6 6 6 6 6 6 6 6 6 6 6 6 1 1 1 1 1 1 1 1 1 1 1 1 1 1
symmnumber: 1
zpe: 605479.8 jmol-1
zpe.correction: 0.230615 hartree
zpe.thermalcorrener: 0.246234 hartree
zpe.thermalcorrenthalpy: 0.247178 hartree
zpe.thermalcorrgfe: 0.186447 hartree
zpe.sumelectzpe: -690.212423 hartree
zpe.sumelectthermal: -690.196804 hartree
zpe.sumelectthermalent: -690.195860 hartree
zpe.sumelectthermalfe: -690.256590 hartree
dipole: 0.5590 6.6732 2.6353
dipole: 7.1965
quadrupole: -96.3224 -85.8054 -88.8713
quadrupole: 0.9713 -7.5794 -3.8456
quadrupole: -5.9894 4.5276 1.4617 0.9713 -7.5794 -3.8456
hfenergy: -690.4430376 hartree
pointgroup: C01 [X(C12H14O3)]
dipole: -0.1796956 2.6822465 -0.8885637 debye
polarizability: 194.5892131|13.405756|154.6712806|6.2599648|-2.7762294|84.9383658 unknown
InChI: InChI=1S/C12H14O3/c1-9(14)10-5-6-12(15-2)11(8-10)4-3-7-13/h5-8H,3-4H2,1-2H3
charge 0 multiplicity 1
29 atoms
O  1.666135 1.813384 0.353787
O  -3.235348 -2.327371 0.075327
O  4.37976 -2.205001 0.467545
C  0.445944 -0.241919 0.358218
C  1.761088 -0.975927 0.547417
C  0.416075 1.186118 0.260347
C  -0.778306 -0.925594 0.271327
C  2.615131 -0.987861 -0.74206
C  -2.01872 -0.249419 0.088711
C  -0.803411 1.884434 0.085506
C  -2.012329 1.164975 -0.000645
C  -3.274281 -1.061583 0.003254
C  3.946979 -1.697252 -0.595047
C  -4.609924 -0.341577 -0.174468
C  1.708008 3.280141 0.339628
H  1.568591 -2.016095 0.863873
H  2.356366 -0.501965 1.348475
H  -0.804678 -2.018716 0.348162
H  2.068047 -1.462805 -1.584078
H  2.824996 0.050322 -1.075074
H  -0.819233 2.975884 0.016139
H  -2.948309 1.716246 -0.137846
H  4.557769 -1.741989 -1.535749
H  -4.62331 0.248478 -1.10997
H  -4.80288 0.355567 0.662077
H  -5.415365 -1.09049 -0.211387
H  1.123844 3.7035 1.178524
H  1.331154 3.683204 -0.619891
H  2.770504 3.536808 0.459397
