program: Gaussian 09
title: 000268446
version: EM64L-G09RevD.01
frameworkgroup: C1[X(C11H16N3O5P)]
method: RPBEPBE
basis: SDD
operation: Freq
keyword: #p
keyword: freq=noraman
keyword: PBEPBE/SDD
title: #p freq=noraman PBEPBE/SDD
converged: YES YES NO NO
title: Mulliken charges:
elementType: P O O O O O N N N C C C C C C C C C C C H H H H H H H H H H H H H H H H
charge: 1.346234 -0.465023 -0.457362 -0.550666 -0.196450 -0.178767 0.111879 -0.742662 0.004430 0.259017 -0.337575 -0.362246 -0.387720 -0.697336 -0.451292 0.449122 -0.291400 -0.490571 -0.179624 -0.323117 0.275792 0.208494 0.202978 0.282706 0.242539 0.209194 0.247717 0.222970 0.231589 0.344914 0.247119 0.251762 0.235907 0.255644 0.233522 0.248283
chargesum: 0.00000
title: Mulliken charges with hydrogens summed into heavy atoms:
elementType: P O O O O O N N N C C C C C C C C C C C
charge: 1.346234 -0.465023 -0.457362 -0.550666 -0.196450 -0.178767 0.111879 -0.397748 0.004430 0.259017 0.146712 0.123438 0.064012 0.004941 0.047589 0.449122 -0.055493 -0.234927 0.053898 -0.074834
polarizability: 2.07832441e+02 -5.68381964e+00 1.85987989e+02 -7.33037890e+00 3.54953341e+00 1.27172517e+02
1716.lowfreq: -11.5588 -4.5290 -3.3590 -0.0017 -0.0017 0.0010 6.2838 19.6269 28.0612
frequency: -10.4373 19.4173 27.9117 46.3569 56.4053 59.0427 68.6710 102.7963 137.6436 146.8947 166.2297 197.8395 217.6552 242.3238 249.7697 271.9856 290.2729 303.6728 344.1092 356.9538 362.9446 385.8344 394.7975 401.6683 430.8940 476.1548 505.7689 521.6226 545.1077 553.5139 583.3924 613.3279 635.2310 663.3124 680.5694 721.2214 763.3509 773.9319 792.4825 796.0651 836.7510 858.9586 900.8656 923.7236 931.6519 938.5263 942.4682 973.6248 986.4528 999.5257 1009.5317 1026.9810 1047.9459 1052.2381 1059.9961 1084.0848 1090.3864 1109.1804 1135.9990 1191.3749 1196.2996 1208.1147 1217.2460 1232.4621 1241.7050 1260.1984 1307.7277 1312.9430 1322.7971 1330.1749 1350.6433 1353.5245 1374.8489 1396.0723 1403.4701 1413.5216 1415.8572 1432.2918 1438.8943 1460.0478 1465.6067 1483.0518 1485.6417 1486.0677 1557.8796 1587.5965 2973.6086 2987.5009 2989.8811 2995.6962 3003.9351 3034.6754 3047.3309 3089.6140 3096.7183 3113.2498 3116.6400 3123.0757 3130.4837 3138.4051 3166.1728 3493.9902
redmass: 4.4888 5.4908 5.0024 5.3166 6.6039 4.9751 2.9578 5.0551 5.9180 8.6360 3.6249 1.5447 6.4923 5.0975 3.7670 1.8360 2.8113 4.3607 4.0300 3.3251 2.8581 6.7351 3.2821 6.9753 4.3289 3.3473 4.8824 4.5349 2.2468 4.4023 3.7156 7.8199 5.8032 7.4389 4.8890 1.9126 11.3933 1.3831 2.4390 3.3408 2.5930 2.6695 1.7989 1.3673 4.3980 1.4457 4.4449 1.8761 1.4366 2.8648 3.2125 3.4295 1.9860 3.1879 2.7317 3.3717 13.0147 1.5482 2.1412 1.3928 2.1671 1.1735 6.9805 2.0432 1.2036 1.2790 6.0584 1.3007 1.3326 1.3563 1.2477 1.2488 1.2673 1.2373 1.8550 1.4963 2.0100 1.4399 1.0869 2.1896 1.1116 1.0602 1.0453 1.0913 5.4970 5.9978 1.0618 1.0644 1.0630 1.0372 1.0646 1.1009 1.1010 1.0994 1.1009 1.0995 1.0914 1.0962 1.0875 1.0922 1.1000 1.0755
irintensity: 1.0297 1.4042 6.5550 0.8424 0.2398 0.4585 0.2697 0.6224 1.1485 6.4170 1.7781 1.1916 1.9556 4.2144 1.3457 1.1909 0.7437 4.3491 3.9844 21.2528 23.0779 42.4009 2.5335 5.1779 2.9438 21.6809 17.4256 7.3669 45.2405 9.1943 10.0220 41.2176 29.9853 77.5723 25.6042 37.7646 33.2225 19.6084 105.4913 38.4966 32.6046 8.6186 5.0627 5.4821 93.8832 7.6636 33.9062 18.7617 2.8272 116.3998 6.8466 3.3664 57.1514 70.8631 25.8593 14.4320 149.9821 8.9148 1.6658 2.3184 9.2484 16.3849 63.0348 5.6312 0.4671 3.4140 1.9431 0.8500 4.7279 4.9424 6.1075 2.3561 3.4910 40.7423 118.9056 27.1676 16.6032 15.2856 6.3994 19.7632 6.1670 14.9637 15.3498 9.6111 10.0877 2.0201 33.0049 17.7016 16.3744 15.6025 48.7948 9.1761 5.5997 29.2517 25.2795 1.2244 18.3741 0.9421 3.2325 24.6800 21.8756 24.0416
temp: 298.150 k
press: 1.00000 atm
elementType: 15 8 8 8 8 8 7 7 7 6 6 6 6 6 6 6 6 6 6 6 1 1 1 1 1 1 1 1 1 1 1 1 1 1 1 1
symmnumber: 1
zpe: 719213.3 jmol-1
zpe.correction: 0.273934 hartree
zpe.thermalcorrener: 0.293370 hartree
zpe.thermalcorrenthalpy: 0.294314 hartree
zpe.thermalcorrgfe: 0.224047 hartree
zpe.sumelectzpe: -1308.726314 hartree
zpe.sumelectthermal: -1308.706877 hartree
zpe.sumelectthermalent: -1308.705933 hartree
zpe.sumelectthermalfe: -1308.776200 hartree
dipole: -2.9872 8.3047 1.4346
dipole: 8.9415
quadrupole: -157.3280 -128.1425 -127.6026
quadrupole: 11.6017 4.2618 -1.9013
quadrupole: -19.6370 9.5485 10.0884 11.6017 4.2618 -1.9013
hfenergy: -1309.0002474 hartree
pointgroup: C01 [X(C11H16N3O5P1)]
dipole: 1.2531062 3.242851 -0.5375129 debye
polarizability: 208.0904939|5.2158172|185.7806298|-7.3783467|-2.8844424|127.1218231 unknown
InChI: InChI=1S/C11H16N3O5P/c1-2-11(14(15)16)8-18-20(17,19-9-11)13-7-10-4-3-5-12-6-10/h3-6,13H,2,7-9H2,1H3
charge 0 multiplicity 1
36 atoms
P  -0.636414 -1.963615 0.013582
O  -1.586215 -1.449219 -1.355703
O  -1.23239 -0.95758 1.3069
O  -0.754775 -3.497131 0.359996
O  -4.586262 0.033391 -0.998286
O  -4.211429 0.054657 1.245959
N  -3.833655 0.193895 0.030014
N  0.912272 -1.250436 -0.369093
N  5.44706 0.105054 -0.371237
C  -2.375642 0.703083 -0.24074
C  -1.829054 0.003026 -1.508646
C  -1.49503 0.466029 1.004681
C  -2.510446 2.229183 -0.550587
C  -3.10834 3.093553 0.580141
C  2.04617 -1.379186 0.590969
C  3.121397 -0.350285 0.28702
C  2.871147 1.042811 0.373379
C  4.425912 -0.758232 -0.089342
C  3.911398 1.951957 0.090008
C  5.179425 1.439916 -0.278332
H  -2.564253 0.066813 -2.324685
H  -0.887659 0.51206 -1.794126
H  -0.53601 0.997039 0.838008
H  -1.986497 0.837041 1.91454
H  -3.129381 2.329455 -1.462204
H  -1.498368 2.600073 -0.805777
H  -4.111988 2.745854 0.880176
H  -2.469984 3.106785 1.481124
H  -3.207253 4.136057 0.230273
H  1.180972 -1.309761 -1.358744
H  2.484135 -2.397551 0.57158
H  1.634223 -1.22258 1.606091
H  1.876019 1.400916 0.661125
H  4.670992 -1.825249 -0.168565
H  3.754802 3.033399 0.154311
H  6.013819 2.112382 -0.507407
