program: Gaussian 09
title: 000268485
version: EM64L-G09RevD.01
frameworkgroup: C1[X(C14H25N2PS)]
method: RPBEPBE
basis: SDD
operation: Freq
keyword: #p
keyword: freq=noraman
keyword: PBEPBE/SDD
title: #p freq=noraman PBEPBE/SDD
converged: YES YES NO NO
title: Mulliken charges:
elementType: S P N N C C C C C C C C C C C C C C H H H H H H H H H H H H H H H H H H H H H H H H H
charge: -0.273801 0.618550 -0.657365 -0.673058 -0.320623 -0.298376 0.031200 -0.325876 -0.349154 -0.340528 -0.343376 -0.305894 -0.326120 -0.690353 -0.687836 -0.221841 -0.214912 -0.227030 0.241631 0.206640 0.224966 0.222266 0.319186 0.311035 0.172099 0.209943 0.206215 0.181893 0.189602 0.204797 0.195886 0.198825 0.262575 0.286857 0.206176 0.213715 0.215742 0.218524 0.209824 0.210015 0.231875 0.233737 0.232367
chargesum: 0.00000
title: Mulliken charges with hydrogens summed into heavy atoms:
elementType: S P N N C C C C C C C C C C C C C C
charge: -0.273801 0.618550 -0.338179 -0.362023 0.127648 0.148856 0.031200 0.056166 0.038954 0.053871 0.051335 -0.043319 -0.039263 -0.054719 -0.049472 0.010034 0.018825 0.005337
polarizability: 2.52709919e+02 1.30807559e+00 1.86337218e+02 -7.17769087e+00 -2.32255770e+01 1.86555820e+02
1716.lowfreq: -5.3413 -0.0003 0.0001 0.0019 4.3109 6.0859 13.6489 15.6586 28.6058
frequency: 12.7777 13.3657 28.3507 30.4467 38.0848 54.1662 68.4952 88.3682 99.6282 103.5686 114.0951 133.5912 149.4507 163.3144 200.0539 211.9524 219.0767 226.6153 231.2610 248.5014 284.0698 318.4374 359.0448 377.2882 392.4280 398.9548 417.1127 440.0613 493.6270 498.4032 555.5717 578.0896 612.5919 687.9398 702.1216 730.4405 733.9268 757.2713 760.4360 786.6310 805.8182 821.2304 862.6676 899.0241 901.3160 933.1819 936.3730 938.6454 985.9769 986.8879 1005.8851 1010.3162 1014.2236 1019.2869 1072.6725 1074.4648 1075.4953 1080.2269 1087.4769 1107.1270 1115.7230 1117.4811 1129.8469 1139.7233 1173.4592 1185.6485 1210.7569 1215.4763 1258.1327 1263.6001 1276.0689 1284.5756 1285.3579 1291.9304 1306.3182 1334.8838 1338.4113 1356.2314 1358.1360 1378.6572 1386.8171 1389.7322 1390.5137 1394.5727 1425.5514 1459.9436 1462.9293 1466.0824 1466.6316 1473.5734 1474.5090 1477.2368 1477.6038 1484.7930 1486.4660 1492.9217 1585.5980 1594.6068 2943.1576 2953.1954 2958.1682 2960.0791 2969.5531 2972.2172 2973.0511 2974.2021 3005.9361 3008.3685 3020.8945 3024.2089 3042.6206 3046.3493 3069.0414 3071.4077 3072.1826 3074.3393 3122.1311 3126.8992 3137.9528 3150.0977 3165.0052 3465.9988 3542.1840
redmass: 3.5978 3.7270 3.4452 2.5791 4.9705 1.8464 1.8993 3.6370 2.5832 2.4338 4.1446 2.9027 3.7609 3.2346 3.4100 3.0494 3.3343 1.3764 1.2093 2.8312 3.9900 3.1371 2.8675 2.1011 3.5955 2.7583 3.4770 3.6551 3.5551 3.9308 5.6495 1.7749 6.0448 6.9317 2.0511 1.1177 1.0697 1.8852 1.7964 1.2476 1.6139 2.3152 1.2423 1.7269 1.7389 1.2037 1.2224 1.3729 3.0480 1.7809 1.3279 4.2468 3.9366 3.0739 2.5617 1.9917 2.2269 2.5577 2.9065 2.4271 2.5089 3.1313 1.5128 1.5140 1.0562 1.1265 1.3789 1.3849 1.2624 1.3023 1.2002 1.0699 1.1436 1.0905 1.3256 1.3383 1.3150 1.4867 1.5009 6.4320 1.2407 1.3085 1.2413 1.2489 2.1115 1.0664 2.0483 1.0732 1.0749 1.0630 1.0514 1.0540 1.0426 1.0692 1.0811 1.0885 6.0396 5.9534 1.0663 1.0620 1.0622 1.0622 1.0609 1.0369 1.0581 1.0383 1.0946 1.0952 1.0991 1.0963 1.1039 1.1022 1.1006 1.1010 1.0997 1.0993 1.0877 1.0869 1.0913 1.0959 1.1014 1.0746 1.0756
irintensity: 1.0210 0.0560 0.1680 0.2418 0.9305 0.3166 0.5140 0.0904 0.5278 0.6702 3.9932 0.6018 0.9216 5.5224 3.8090 1.9890 1.2436 0.5129 0.1888 8.5107 5.1294 5.4605 23.2019 28.3324 35.0215 10.7894 13.6811 1.9972 30.2462 70.3909 24.8021 138.6739 4.5448 23.7692 46.1467 27.0512 10.0801 75.2232 42.7706 4.2480 25.7478 52.5016 0.2125 14.3285 15.3739 0.9956 0.8704 0.0591 0.8818 0.7185 0.0282 5.5540 13.0207 2.0736 5.9247 20.4160 5.9866 40.0380 20.1340 19.9813 40.9508 97.3389 19.6635 14.5588 0.0343 5.1430 6.3961 10.1052 11.0663 13.0608 0.4897 0.3740 3.8789 12.2898 4.8758 1.6641 0.4252 3.8758 3.0669 0.5487 16.9587 7.4107 22.2682 40.9984 20.9844 2.8524 11.4932 0.7967 2.3105 0.9801 6.7411 8.6950 13.5445 8.7835 16.0406 15.1518 0.3680 1.2971 34.3641 38.8744 25.0429 9.2930 82.7609 35.4577 67.1460 31.1818 5.3060 4.5920 6.3704 4.4272 28.2969 41.2413 72.6428 101.9818 53.2235 50.3287 1.5612 2.2803 1.9950 26.6239 39.0036 9.5673 12.6333
temp: 298.150 k
press: 1.00000 atm
elementType: 16 15 7 7 6 6 6 6 6 6 6 6 6 6 6 6 6 6 1 1 1 1 1 1 1 1 1 1 1 1 1 1 1 1 1 1 1 1 1 1 1 1 1
symmnumber: 1
zpe: 964176.1 jmol-1
zpe.correction: 0.367235 hartree
zpe.thermalcorrener: 0.389766 hartree
zpe.thermalcorrenthalpy: 0.390710 hartree
zpe.thermalcorrgfe: 0.310597 hartree
zpe.sumelectzpe: -1395.865217 hartree
zpe.sumelectthermal: -1395.842686 hartree
zpe.sumelectthermalent: -1395.841742 hartree
zpe.sumelectthermalfe: -1395.921855 hartree
dipole: 0.4595 2.1793 -3.8046
dipole: 4.4085
quadrupole: -112.5818 -123.1232 -130.8822
quadrupole: 0.5546 -1.2452 2.3940
quadrupole: 9.6139 -0.9274 -8.6865 0.5546 -1.2452 2.3940
hfenergy: -1396.2324525 hartree
pointgroup: C01 [X(C14H25N2P1S1)]
dipole: 0.5007726 -0.5274889 -1.5745825 debye
polarizability: 197.0515801|29.6134147|237.4047436|-17.1207476|15.8859972|191.1466329 unknown
InChI: InChI=1S/C14H25N2PS/c1-3-5-12-15-17(18,16-13-6-4-2)14-10-8-7-9-11-14/h7-11,15-16H,3-6,12-13H2,1-2H3
charge 0 multiplicity 1
43 atoms
S  -0.822464 0.156903 2.523404
P  -0.455146 -0.417664 0.53705
N  -0.906981 0.835099 -0.57763
N  1.196001 -0.724293 -0.011207
C  -1.767483 1.983561 -0.257489
C  2.250427 0.272336 0.311061
C  -1.254058 -2.051542 0.086545
C  -1.029116 3.336647 -0.369842
C  3.549919 -0.045187 -0.454258
C  -1.952152 4.536391 -0.057317
C  4.679257 0.96091 -0.132177
C  -1.054002 -2.608423 -1.200975
C  -2.075182 -2.705416 1.031502
C  -1.230542 5.895298 -0.185242
C  5.993762 0.638346 -0.874627
C  -1.680164 -3.829669 -1.537841
C  -2.702027 -3.924555 0.687457
C  -2.505673 -4.487538 -0.595221
H  -2.118901 1.845999 0.783424
H  -2.662617 1.983706 -0.914464
H  2.452394 0.312658 1.403837
H  1.872292 1.269297 0.015768
H  -0.490549 0.785436 -1.510135
H  1.492911 -1.698315 0.137745
H  -0.609696 3.450987 -1.392153
H  -0.171939 3.325494 0.332427
H  3.340695 -0.045887 -1.541946
H  3.891619 -1.069928 -0.195099
H  -2.826787 4.515692 -0.739911
H  -2.355106 4.4254 0.969416
H  4.344132 1.983883 -0.39819
H  4.862989 0.967637 0.961219
H  -0.415531 -2.097637 -1.930712
H  -2.209129 -2.251232 2.021062
H  -0.842528 6.043958 -1.210899
H  -0.372115 5.954001 0.510004
H  -1.909639 6.736895 0.044579
H  6.784369 1.371155 -0.63042
H  6.367894 -0.366002 -0.600217
H  5.845624 0.653394 -1.970838
H  -1.526021 -4.265293 -2.531338
H  -3.340191 -4.433084 1.418377
H  -2.992546 -5.432917 -0.860032
