program: Gaussian 09
title: 000268490
version: EM64L-G09RevD.01
frameworkgroup: C1[X(C22H19NO)]
method: RPBEPBE
basis: SDD
operation: Freq
keyword: #p
keyword: freq=noraman
keyword: PBEPBE/SDD
title: #p freq=noraman PBEPBE/SDD
converged: YES YES NO NO
title: Mulliken charges:
elementType: O N C C C C C C C C C C C C C C C C C C C C C C H H H H H H H H H H H H H H H H H H H
charge: -0.336803 0.014511 0.092122 -0.391509 -0.525126 0.409012 0.426918 -0.197042 0.511450 -0.340409 -0.401811 -0.417800 -0.347468 -0.405284 -0.406586 -0.246101 -0.239817 -0.254465 -0.251887 -0.232936 -0.246509 -0.242339 -0.245904 -0.242575 0.233644 0.248603 0.248563 0.272311 0.287030 0.251197 0.225981 0.247718 0.224802 0.246548 0.229395 0.222422 0.224903 0.223955 0.224513 0.224124 0.229719 0.225324 0.227607
chargesum: 0.00000
title: Mulliken charges with hydrogens summed into heavy atoms:
elementType: O N C C C C C C C C C C C C C C C C C C C C C C
charge: -0.336803 0.014511 0.092122 -0.157865 -0.027960 0.409012 0.426918 0.075270 0.511450 -0.053379 -0.150614 -0.191819 -0.099750 -0.180482 -0.160038 -0.016706 -0.017396 -0.029562 -0.027932 -0.008423 -0.022385 -0.012620 -0.020580 -0.014968
polarizability: 2.79175957e+02 -7.70547329e+00 2.16911699e+02 -1.90011476e+01 -2.09941818e+00 2.00787957e+02
1716.lowfreq: -15.0648 -11.6356 -3.3650 -0.0004 0.0002 0.0006 25.8588 40.4379 46.4492
frequency: 24.5521 40.1934 46.4231 51.7717 61.2752 71.9977 107.4557 132.7814 159.6705 206.5534 230.5400 243.9844 254.0517 259.8984 280.6405 294.2836 318.4292 381.0334 400.2756 402.6519 405.5933 461.5676 487.0437 509.6135 547.9978 569.7893 596.5292 614.2082 615.4202 616.4877 641.4286 654.3383 677.5646 699.7480 700.3469 703.3991 707.6138 745.9473 759.1014 768.3470 773.0874 776.5814 845.6202 848.5250 853.7985 886.1393 900.1729 918.0977 922.2642 932.7904 953.7701 970.7377 973.8624 974.7317 977.8140 989.3996 990.3904 990.8489 993.3922 994.6855 996.5299 1004.0622 1029.9353 1032.4006 1033.7760 1047.5101 1087.2156 1088.8304 1094.7258 1137.7996 1172.0422 1172.8161 1173.4283 1174.5104 1178.6965 1194.6520 1197.3113 1199.2674 1221.2726 1229.0902 1236.8890 1279.1529 1295.3381 1317.9839 1327.0433 1328.0294 1349.7229 1376.1712 1379.8417 1388.6563 1432.6508 1435.2012 1442.8163 1467.4368 1482.9457 1485.1282 1485.4549 1556.9811 1587.0294 1590.4984 1593.2732 1609.6734 1613.2722 1614.2212 2966.1335 3043.3472 3052.1523 3117.5654 3119.5210 3119.7972 3123.1927 3128.9330 3133.3911 3133.5502 3141.8109 3144.4368 3145.5800 3156.5765 3157.9237 3162.5908 3167.6568 3178.8085 3204.8261
redmass: 4.2648 4.0017 4.6482 4.6207 4.3361 4.3949 4.7900 6.3686 4.7990 5.7440 4.4993 4.5512 4.5376 5.4243 2.9480 6.3313 4.0449 3.5589 2.8006 2.8049 2.8241 4.3832 4.1131 3.4535 3.7428 4.4400 4.2577 6.3167 6.3680 6.3472 5.7468 4.3998 5.8096 1.6474 1.5869 1.8391 4.0161 1.6741 1.9661 2.1103 2.5629 2.2723 1.2515 1.2542 1.2484 2.7958 2.6424 1.4662 1.8192 1.9109 2.4743 2.3994 1.4886 1.3987 1.4004 4.6863 3.6742 3.7337 1.6014 1.5831 1.3590 2.8122 2.2114 2.1379 2.0843 2.1113 1.5907 1.6257 1.6916 1.3055 1.7041 1.1187 1.3105 1.0768 2.0499 1.1254 1.1836 1.1452 3.3263 3.0847 1.8285 1.5950 1.6800 1.7795 1.3824 1.3667 1.3998 6.5201 7.9560 4.3733 2.2479 2.2474 2.0708 1.1244 2.1549 2.2387 2.2011 6.8334 5.8961 6.1231 5.8608 5.9129 5.9845 6.0689 1.0675 1.0934 1.0848 1.0859 1.0872 1.0850 1.0845 1.0883 1.0879 1.0911 1.0937 1.0959 1.0927 1.0958 1.0989 1.1015 1.1003 1.0960 1.0947
irintensity: 0.3275 0.0462 0.1930 0.0587 0.0921 0.3278 2.6228 4.6627 0.7127 1.8582 0.4181 0.4583 0.2448 2.7467 0.0797 1.8932 0.9697 1.8299 0.0743 0.0257 0.2357 0.5075 3.7554 7.8300 4.0202 9.9939 13.4984 1.1636 0.3825 0.5210 28.3139 30.8343 0.4934 53.5855 89.2406 24.4510 6.3411 37.8044 15.1111 40.8842 18.4650 23.2042 0.5991 0.6982 0.9196 1.8409 10.2520 1.2625 2.5447 0.1946 3.7971 0.8225 0.4158 0.6038 0.8085 0.1128 0.6232 0.6637 0.7426 0.2023 0.1429 1.1528 9.7721 16.4559 3.0998 2.2284 8.1448 7.5962 7.5753 28.0788 5.8575 1.1832 3.4695 0.4800 28.4564 0.5390 6.0418 1.0410 12.9484 15.4487 4.4957 15.9212 1.5108 1.9746 2.3439 1.0230 3.2565 0.8018 0.0809 1.3307 17.7923 4.9145 12.9413 12.8727 5.9006 10.6883 38.0283 56.0320 2.4215 1.2033 1.3345 5.5025 2.6023 5.6169 30.8456 23.8278 14.9580 8.0615 1.4981 1.2244 2.0927 3.9436 8.1186 10.5234 28.0282 35.2496 36.2243 19.8059 33.1539 26.1149 16.2579 5.5741 3.1219
temp: 298.150 k
press: 1.00000 atm
elementType: 8 7 6 6 6 6 6 6 6 6 6 6 6 6 6 6 6 6 6 6 6 6 6 6 1 1 1 1 1 1 1 1 1 1 1 1 1 1 1 1 1 1 1
symmnumber: 1
zpe: 905910.1 jmol-1
zpe.correction: 0.345043 hartree
zpe.thermalcorrener: 0.364415 hartree
zpe.thermalcorrenthalpy: 0.365360 hartree
zpe.thermalcorrgfe: 0.296278 hartree
zpe.sumelectzpe: -977.990065 hartree
zpe.sumelectthermal: -977.970692 hartree
zpe.sumelectthermalent: -977.969748 hartree
zpe.sumelectthermalfe: -978.038830 hartree
dipole: -0.8667 -1.5085 -2.9873
dipole: 3.4570
quadrupole: -127.5929 -130.3605 -141.2486
quadrupole: -2.4393 -8.5905 -3.1646
quadrupole: 5.4744 2.7068 -8.1813 -2.4393 -8.5905 -3.1646
hfenergy: -978.3351079 hartree
pointgroup: C01 [X(C22H19N1O1)]
dipole: 0.4526441 1.2820581 -0.0359017 debye
polarizability: 274.7849062|-26.6857458|206.8081698|5.9997234|4.2525757|215.2825372 unknown
InChI: InChI=1S/C22H19NO/c24-23-17-16-21(18-10-4-1-5-11-18)22(23,19-12-6-2-7-13-19)20-14-8-3-9-15-20/h1-15,17,21H,16H2
charge 0 multiplicity 1
43 atoms
O  -1.183617 -2.210344 1.486743
N  -0.750317 -0.973687 1.607962
C  -0.542832 -0.046386 0.338899
C  0.379002 1.082267 0.964646
C  -0.065414 1.119194 2.46453
C  -1.966487 0.435311 -0.022124
C  0.103193 -0.821958 -0.810751
C  -0.526243 -0.286485 2.728426
C  1.882536 0.858186 0.787362
C  -2.91166 -0.549612 -0.421766
C  -0.075777 -0.358564 -2.138643
C  -2.386286 1.787188 0.040532
C  0.93663 -1.946094 -0.586751
C  2.541088 1.454008 -0.318929
C  2.655513 0.088273 1.693696
C  -4.235017 -0.189195 -0.745867
C  0.573323 -0.993453 -3.219968
C  -3.712062 2.150066 -0.293957
C  1.578047 -2.586539 -1.668442
C  3.927767 1.28394 -0.520819
C  4.043945 -0.083364 1.497795
C  -4.642783 1.164521 -0.687403
C  1.403642 -2.113357 -2.988785
C  4.686714 0.51282 0.389028
H  0.140581 2.036004 0.466618
H  -0.892393 1.842647 2.618557
H  0.762161 1.427248 3.127538
H  -0.718136 -0.752948 3.695292
H  -2.598206 -1.597576 -0.460413
H  -0.733167 0.497163 -2.330372
H  -1.693286 2.580428 0.33903
H  1.069995 -2.334161 0.426019
H  1.959455 2.051253 -1.03218
H  2.174996 -0.386634 2.556882
H  -4.948518 -0.964796 -1.045706
H  0.424428 -0.618872 -4.239088
H  -4.013452 3.202643 -0.246049
H  2.21321 -3.459093 -1.478979
H  4.414694 1.752212 -1.383568
H  4.622841 -0.682927 2.209563
H  -5.669682 1.445771 -0.946332
H  1.903363 -2.613618 -3.826099
H  5.763811 0.380319 0.23737
