program: Gaussian 09
title: 000268433
version: EM64L-G09RevD.01
frameworkgroup: C1[X(C8H15N2O5P)]
method: RPBEPBE
basis: SDD
operation: Freq
keyword: #p
keyword: freq=noraman
keyword: PBEPBE/SDD
title: #p freq=noraman PBEPBE/SDD
converged: YES YES NO NO
title: Mulliken charges:
elementType: P O O O O O N N C C C C C C C C H H H H H H H H H H H H H H H
charge: 1.320881 -0.454070 -0.465162 -0.574955 -0.200140 -0.182330 -0.489575 0.112327 -0.022528 -0.442813 0.267612 -0.351134 -0.369723 -0.696830 -0.389403 -0.699101 0.280677 0.250413 0.275588 0.272407 0.225006 0.220398 0.276589 0.224576 0.231652 0.224943 0.240383 0.213588 0.245340 0.225213 0.230170
chargesum: 0.00000
title: Mulliken charges with hydrogens summed into heavy atoms:
elementType: P O O O O O N N C C C C C C C C
charge: 1.320881 -0.454070 -0.465162 -0.574955 -0.200140 -0.182330 -0.489575 0.112327 0.258149 0.083188 0.267612 0.146280 0.127263 -0.015659 0.064568 0.001621
polarizability: 1.59362521e+02 1.94386216e-01 1.30152999e+02 1.35826031e+00 -1.26893576e+00 1.22490016e+02
1716.lowfreq: -14.2720 -9.9031 -6.7085 -0.0018 0.0009 0.0011 28.2437 43.4190 47.1495
frequency: 27.6473 43.1468 47.0228 62.2104 80.6550 95.5667 136.6382 155.4950 170.1726 200.8784 203.0638 221.5129 252.9229 262.7866 276.4801 299.0035 328.1966 349.8410 360.8269 390.3008 406.8872 415.6657 439.7860 499.0045 518.9918 534.8688 563.1004 653.4517 667.2925 687.0864 732.5339 762.5093 772.9357 830.6935 853.8567 898.5374 904.2971 931.5571 938.0147 971.4003 998.6632 1028.1041 1048.7235 1058.5194 1069.4964 1074.9205 1088.6674 1124.6702 1137.3807 1146.5252 1168.9722 1193.9039 1216.4449 1241.7019 1243.7085 1257.3240 1311.1021 1330.2816 1351.1331 1374.1259 1377.2697 1399.3099 1401.8197 1411.3967 1433.4978 1436.8809 1458.8911 1464.0085 1466.6469 1474.3904 1484.3063 1485.8379 2988.1582 2992.2900 2996.0823 3006.9789 3014.7166 3049.4924 3080.8633 3081.7871 3085.1669 3090.6412 3097.2481 3105.2152 3116.1823 3125.0072 3192.8193
redmass: 3.6952 4.0815 6.6678 5.9436 2.4606 5.8035 5.0342 4.2613 3.6426 1.2644 1.4684 5.5102 3.2367 3.7466 2.0810 3.4648 4.7645 3.3935 2.9300 4.6704 3.3629 4.2678 5.0742 4.8247 5.3796 5.3485 5.2131 8.8785 6.8220 5.8462 4.5385 11.7717 1.4058 3.7368 2.5952 1.2750 1.7760 5.1789 4.2877 2.2901 2.7826 1.2986 1.7156 2.4453 1.6511 5.2330 3.3470 1.2908 2.1527 1.4699 1.7418 2.1163 6.7229 1.2790 1.6767 1.2297 1.2936 1.3576 1.2556 1.2655 1.5367 1.4542 2.2953 1.4207 1.2907 1.1142 1.0879 1.1064 1.1300 1.0475 1.0562 1.0459 1.0359 1.0600 1.0371 1.0655 1.0640 1.1012 1.0607 1.0954 1.0900 1.0995 1.1009 1.0970 1.1011 1.0982 1.1180
irintensity: 1.2817 0.9019 0.2967 0.6894 0.4566 2.2808 1.8084 3.8580 1.7184 0.1596 0.9349 2.1452 1.0822 13.7052 6.4316 1.2453 3.7065 15.4473 8.5604 14.6650 6.9576 13.0196 9.6061 3.1311 4.7646 14.6491 12.8586 127.3950 74.5761 59.4050 8.3257 25.1344 16.1467 159.0578 6.7349 7.8228 7.2202 78.1757 58.3863 57.9315 100.6968 61.6186 29.8888 46.7316 27.5279 91.9043 15.2095 6.4070 0.7501 8.9671 7.4816 8.2428 59.6105 0.1275 22.7790 1.8104 0.7960 3.9349 9.5285 4.0352 11.2943 34.0947 130.2763 18.0523 4.1410 11.3164 14.7463 5.7961 10.3485 11.1067 14.2993 15.8604 18.8153 14.5690 15.0019 12.5771 40.2148 4.6624 14.4780 9.9990 16.8817 29.5773 25.9194 21.6850 0.9017 0.9882 4.1807
temp: 298.150 k
press: 1.00000 atm
elementType: 15 8 8 8 8 8 7 7 6 6 6 6 6 6 6 6 1 1 1 1 1 1 1 1 1 1 1 1 1 1 1
symmnumber: 1
zpe: 626413.2 jmol-1
zpe.correction: 0.238588 hartree
zpe.thermalcorrener: 0.256312 hartree
zpe.thermalcorrenthalpy: 0.257256 hartree
zpe.thermalcorrgfe: 0.192154 hartree
zpe.sumelectzpe: -1139.279959 hartree
zpe.sumelectthermal: -1139.262235 hartree
zpe.sumelectthermalent: -1139.261291 hartree
zpe.sumelectthermalfe: -1139.326393 hartree
dipole: -2.1360 8.3046 3.0232
dipole: 9.0923
quadrupole: -96.3058 -110.9444 -104.5653
quadrupole: 2.7092 -0.0417 -3.0228
quadrupole: 7.6327 -7.0059 -0.6268 2.7092 -0.0417 -3.0228
hfenergy: -1139.5185467 hartree
pointgroup: C01 [X(C8H15N2O5P1)]
dipole: 0.9720818 3.3636232 -0.7329848 debye
polarizability: 159.3088576|-1.7279115|129.7149577|-0.235838|2.3598083|122.9817202 unknown
InChI: InChI=1S/C8H15N2O5P/c1-3-8(10(11)12)5-14-16(13,15-6-8)9-4-7(9)2/h7H,3-6H2,1-2H3
charge 0 multiplicity 1
31 atoms
P  1.244777 -1.186902 -0.029526
O  0.052725 -1.25731 -1.296571
O  0.320905 -0.546563 1.295117
O  1.953811 -2.56667 0.275309
O  -3.275973 -1.158619 -0.833265
O  -2.815566 -0.97085 1.38715
N  2.228819 0.224461 -0.509938
N  -2.605517 -0.685378 0.155542
C  3.60615 0.398092 0.135119
C  3.498937 -0.035291 -1.312935
C  -1.52191 0.396477 -0.187594
C  -0.776359 -0.043359 -1.471167
C  -0.578185 0.598732 1.017361
C  3.972685 1.810441 0.540132
C  -2.313316 1.704923 -0.505879
C  -3.174347 2.263062 0.647495
H  3.898262 -0.395728 0.837365
H  3.66758 0.693711 -2.111584
H  3.746028 -1.076389 -1.55471
H  -1.497389 -0.318193 -2.255217
H  -0.137192 0.797572 -1.80123
H  0.02916 1.503357 0.820843
H  -1.146852 0.709703 1.950988
H  3.624777 2.537974 -0.213198
H  3.516609 2.070077 1.512019
H  5.069729 1.906124 0.638861
H  -2.953582 1.500327 -1.384607
H  -1.570706 2.465396 -0.816536
H  -3.916361 1.527335 1.003462
H  -2.562712 2.575555 1.512022
H  -3.727483 3.151435 0.295772
