program: Gaussian 09
title: 000022894
version: EM64L-G09RevD.01
frameworkgroup: C1[X(C22H31NO2)]
method: RPBEPBE
basis: SDD
operation: Freq
keyword: #p
keyword: freq=noraman
keyword: PBEPBE/SDD
title: #p freq=noraman PBEPBE/SDD
converged: YES YES NO NO
title: Mulliken charges:
elementType: O O N C C C C C C C C C C C C C C C C C C C C C C H H H H H H H H H H H H H H H H H H H H H H H H H H H H H H H
charge: -0.424631 -0.215151 -0.114737 0.141514 -0.039031 -0.421289 0.342406 -0.426425 0.023395 -0.741325 -0.747152 -0.386810 0.157499 -0.331187 0.397272 -0.291296 -0.345275 -0.313117 -0.310732 -0.484117 -0.446853 -0.308847 -0.674720 -0.693367 -0.252051 0.198808 0.200282 0.233154 0.210280 0.237531 0.254078 0.200305 0.244617 0.225390 0.219973 0.230076 0.197634 0.197092 0.234375 0.226124 0.216011 0.200321 0.184609 0.213539 0.181198 0.239575 0.373624 0.238267 0.228698 0.204822 0.208983 0.220565 0.249470 0.201974 0.204463 0.230190
chargesum: 0.00000
title: Mulliken charges with hydrogens summed into heavy atoms:
elementType: O O N C C C C C C C C C C C C C C C C C C C C C C
charge: -0.051006 -0.215151 -0.114737 0.141514 0.159777 0.012147 0.342406 0.021386 0.023395 -0.042326 -0.071713 0.007916 0.157499 -0.096812 0.397272 -0.065172 -0.129264 0.071813 0.084005 -0.244542 -0.208586 -0.080149 -0.040350 -0.037460 -0.021861
polarizability: 2.28527290e+02 9.90232642e+00 2.83220119e+02 3.33557996e+01 6.11993098e+00 2.34041060e+02
1716.lowfreq: -13.1990 -9.6258 -4.0426 -0.0002 -0.0002 0.0002 7.4969 28.1313 34.6911
frequency: 1.5346 27.9758 34.5234 45.1697 59.9513 69.9600 76.9668 80.4233 100.1898 104.8978 117.9638 146.2951 171.5995 181.0594 192.6013 199.2124 208.4793 215.3951 217.6030 235.0773 245.7596 260.6741 288.6463 291.4348 297.0465 318.9656 323.4319 338.1129 358.1718 414.4636 421.3698 429.5177 437.0918 459.0090 462.6978 469.9479 485.0890 512.0106 525.2803 557.5955 579.8597 614.9195 620.3743 651.7116 679.0035 696.4855 708.8633 738.8863 754.2408 783.8817 785.7794 789.7027 794.6029 799.7905 808.5300 849.1966 866.3454 877.9305 883.7007 909.1662 915.5026 919.5238 936.8223 949.8519 954.5944 959.0728 980.3088 990.0196 994.9207 1014.2886 1028.0803 1037.8357 1047.8221 1072.4202 1074.3809 1075.0619 1085.3111 1091.7229 1102.1803 1118.5089 1133.3415 1143.8598 1148.5207 1164.5504 1173.5627 1179.3836 1186.4132 1197.8764 1218.0918 1234.2981 1243.2839 1255.8710 1262.5319 1269.4416 1282.7681 1284.2744 1293.0250 1303.6122 1312.3214 1326.8667 1354.9456 1360.9680 1366.2005 1369.9613 1376.4453 1382.8866 1383.0305 1385.3637 1398.4881 1400.1799 1404.8408 1440.7916 1456.1614 1458.6758 1460.2440 1463.2870 1467.3015 1470.8091 1473.4036 1473.8595 1479.6255 1480.2168 1487.0689 1487.4425 1490.7960 1493.2306 1518.4412 1584.3687 1602.9048 1630.2317 1636.1591 2840.9659 2848.8693 2864.4906 2980.8529 2981.1437 2982.6853 2988.3785 2996.1156 3003.1951 3007.9549 3026.7432 3031.6691 3033.1910 3052.1279 3071.5911 3073.4037 3075.1860 3077.8016 3079.3399 3085.0643 3088.1387 3091.4420 3104.7306 3119.3978 3123.9323 3133.4216 3147.8010 3157.5136 3175.2483 3204.5005 3489.4781
redmass: 3.7025 3.7429 4.3587 3.7520 3.7384 3.8852 2.4194 2.8610 2.9292 2.4699 3.6436 3.9643 3.2663 3.5885 1.6893 2.5272 1.3217 1.8345 1.8066 2.2777 1.1854 2.9399 2.3748 1.9681 2.9023 3.2734 2.7661 2.5208 3.3323 3.7757 3.4219 2.7452 2.6070 3.1231 2.5867 3.1916 3.0909 6.3152 5.5075 3.2392 2.1577 1.7484 3.4775 3.9867 3.4045 2.3529 3.3767 1.3408 2.1899 2.0720 3.3480 1.5004 1.2240 1.5637 1.8113 2.6132 2.0277 2.2523 2.2712 1.4988 1.5625 1.5186 2.2741 2.3454 1.4831 1.3882 1.3650 1.3610 3.6629 3.1995 2.4267 2.4059 2.2443 1.9073 2.4682 2.0645 2.1678 2.2787 2.7943 2.0024 1.7271 2.2062 1.6035 1.5961 1.2788 1.7375 1.6051 2.1810 1.6002 1.9440 1.6248 1.4593 1.7656 1.7727 1.2101 1.1929 1.2488 1.3341 1.2604 1.4007 1.5062 1.3211 1.3058 2.1797 1.3747 1.2254 1.2309 1.2313 2.7806 1.2187 3.5473 2.3456 1.5356 1.3728 1.0618 1.0545 1.0701 1.0657 1.0547 1.0604 1.0680 1.0640 1.0483 1.0688 1.0752 1.0527 3.7744 6.8743 5.3675 6.4330 8.1432 1.0723 1.0720 1.0711 1.0356 1.0355 1.0358 1.0381 1.0606 1.0789 1.0645 1.0860 1.0870 1.0875 1.0974 1.0982 1.0989 1.0981 1.1014 1.0968 1.0992 1.1003 1.0999 1.0996 1.0868 1.0864 1.0904 1.0952 1.0986 1.0939 1.0914 1.0637
irintensity: 0.0061 0.1276 0.0182 0.3262 0.1861 0.0512 0.3224 0.5561 0.0801 0.1024 0.8118 0.3590 0.6700 0.3969 0.7364 1.2477 0.0548 0.9893 0.4484 0.2398 0.5761 2.3684 0.7587 0.3974 0.2221 0.2180 2.8567 2.3067 0.4781 3.5983 1.3418 11.7972 1.8011 4.7614 3.7878 0.9201 20.6029 0.5376 2.7426 12.6639 45.1620 68.4079 5.5969 2.2061 5.3663 8.9622 29.0505 9.8308 11.8802 67.7752 8.8061 5.8126 6.8849 34.0097 15.8491 0.7222 4.1446 14.2290 2.2869 5.0277 2.8081 4.2197 10.7845 1.0938 2.3320 1.5484 0.3243 1.5454 50.1941 67.1272 5.7552 14.5156 112.5144 2.1107 3.2139 44.3164 2.4505 7.9980 16.2880 9.6641 9.5303 13.4404 5.4055 2.1320 4.9489 10.6983 2.0876 33.1704 16.7362 4.9943 3.9814 18.5866 3.1900 3.2472 5.7532 4.8313 11.4097 4.6603 6.1366 25.9661 4.8184 6.5561 1.1743 4.1998 1.3962 21.2637 11.4869 16.4959 3.3715 23.7360 8.8249 6.4942 1.3779 2.8394 4.5601 5.1519 0.7078 8.5604 3.7537 2.0419 8.0705 11.9579 8.4070 15.3072 8.2916 8.4754 10.9630 7.8975 3.8126 1.1270 194.8875 37.3921 75.4440 250.8386 35.3402 20.3466 28.5867 42.2709 4.4070 17.7725 26.9152 18.3483 17.5886 18.8492 9.5134 32.6711 11.1445 74.9659 49.0724 41.0085 30.2407 44.2021 41.7073 20.4662 1.7841 2.7279 14.8563 31.3795 35.9873 13.3326 11.2803 22.8830
temp: 298.150 k
press: 1.00000 atm
elementType: 8 8 7 6 6 6 6 6 6 6 6 6 6 6 6 6 6 6 6 6 6 6 6 6 6 1 1 1 1 1 1 1 1 1 1 1 1 1 1 1 1 1 1 1 1 1 1 1 1 1 1 1 1 1 1 1
symmnumber: 1
zpe: 1260343.6 jmol-1
zpe.correction: 0.480040 hartree
zpe.thermalcorrener: 0.506465 hartree
zpe.thermalcorrenthalpy: 0.507409 hartree
zpe.thermalcorrgfe: 0.420928 hartree
zpe.sumelectzpe: -1060.226942 hartree
zpe.sumelectthermal: -1060.200517 hartree
zpe.sumelectthermalent: -1060.199573 hartree
zpe.sumelectthermalfe: -1060.286053 hartree
dipole: 0.0295 0.8515 0.2207
dipole: 0.8801
quadrupole: -145.9465 -147.5743 -146.3352
quadrupole: 4.2595 6.0690 -3.5492
quadrupole: 0.6722 -0.9556 0.2835 4.2595 6.0690 -3.5492
hfenergy: -1060.7069815 hartree
pointgroup: C01 [X(C22H31N1O2)]
dipole: 0.0744775 0.3305954 -0.0711857 debye
polarizability: 228.2213248|3.3507501|285.861587|30.9231707|-11.9496549|231.7055568 unknown
InChI: InChI=1S/C22H31NO2/c1-5-23(6-2)16-10-15-22(17(3)4,21(24)25)20-14-9-12-18-11-7-8-13-19(18)20/h7-9,11-14,17,24H,5-6,10,15-16H2,1-4H3
charge 0 multiplicity 1
56 atoms
O  2.539172 -3.029582 0.449071
O  0.40169 -3.628094 1.046868
N  -3.386679 0.241671 0.493742
C  0.713009 -1.510187 -0.247217
C  1.066865 -1.803309 -1.788902
C  -0.847982 -1.400367 -0.09918
C  1.38522 -0.23489 0.34624
C  -1.385237 -1.084399 1.312524
C  1.152819 -2.78677 0.504176
C  2.514451 -1.446248 -2.193547
C  0.742338 -3.262325 -2.210037
C  -2.922567 -0.921186 1.302742
C  1.219049 1.093746 -0.232434
C  2.100507 -0.333943 1.550835
C  1.828964 2.237583 0.434993
C  2.687038 0.789705 2.20393
C  0.480615 1.376617 -1.435048
C  -4.755549 0.045409 -0.056274
C  -3.246064 1.525092 1.236964
C  2.561825 2.059499 1.651765
C  1.694672 3.554257 -0.120389
C  0.36304 2.668571 -1.951604
C  -4.783309 -0.906195 -1.267979
C  -3.155983 2.757286 0.316879
C  0.978089 3.776693 -1.294535
H  0.379012 -1.163779 -2.372659
H  -1.293762 -2.356271 -0.43366
H  -1.222619 -0.613021 -0.775952
H  -0.914041 -0.162756 1.703363
H  -1.127656 -1.903815 2.009358
H  3.241757 -2.031902 -1.606981
H  2.665799 -1.677028 -3.265037
H  2.734653 -0.375835 -2.044513
H  1.47363 -3.978423 -1.793078
H  0.795521 -3.342718 -3.311129
H  -0.268492 -3.580777 -1.899592
H  -3.293283 -0.850117 2.356501
H  -3.368368 -1.839352 0.876037
H  2.23823 -1.309571 2.021739
H  3.2371 0.63829 3.138922
H  -0.013816 0.568566 -1.97244
H  -5.136465 1.031685 -0.378454
H  -5.462089 -0.323594 0.731275
H  -2.315725 1.467495 1.83093
H  -4.081502 1.658449 1.972573
H  3.011927 2.934451 2.13538
H  2.715102 -3.905326 0.892177
H  2.171811 4.389715 0.406304
H  -0.210832 2.832139 -2.870515
H  -5.812311 -1.002192 -1.662792
H  -4.429942 -1.919597 -1.00451
H  -4.130302 -0.516113 -2.068533
H  -2.286879 2.66461 -0.357182
H  -4.062573 2.880283 -0.303331
H  -3.036826 3.677359 0.919641
H  0.881952 4.786014 -1.708927
