program: Gaussian 09
title: 000268441
version: EM64L-G09RevD.01
frameworkgroup: C1[X(C11H17N2O3P)]
method: RPBEPBE
basis: SDD
operation: Freq
keyword: #p
keyword: freq=noraman
keyword: PBEPBE/SDD
title: #p freq=noraman PBEPBE/SDD
converged: YES YES NO NO
title: Mulliken charges:
elementType: P O O O N N C C C C C C C C C C C H H H H H H H H H H H H H H H H H
charge: 1.353460 -0.472537 -0.481381 -0.567723 -0.600912 -0.767571 0.190528 -0.342573 -0.340527 -0.666663 -0.424754 0.450368 -0.437312 -0.361585 -0.216431 -0.222341 -0.238910 0.239350 0.225883 0.224429 0.235247 0.258566 0.206552 0.205567 0.273632 0.273418 0.343716 0.242509 0.250051 0.235676 0.244649 0.229020 0.227855 0.230742
chargesum: 0.00000
title: Mulliken charges with hydrogens summed into heavy atoms:
elementType: P O O O N N C C C C C C C C C C C
charge: 1.353460 -0.472537 -0.481381 -0.567723 -0.053862 -0.423855 0.190528 0.122660 0.119149 0.004022 0.067806 0.450368 -0.201636 -0.116935 0.012589 0.005513 -0.008168
polarizability: 1.98269153e+02 -2.39590346e+00 1.72046764e+02 5.79366742e-01 8.26812017e+00 1.06648326e+02
1716.lowfreq: -9.8248 -4.7596 -0.0015 0.0001 0.0005 3.3849 18.3423 33.3608 34.0896
frequency: 18.2139 33.1925 34.0728 72.8714 82.1288 130.1205 163.3698 176.9869 186.9963 212.8629 226.5102 240.9323 259.6597 271.6472 287.6545 340.9941 383.1577 396.5291 402.5286 407.6412 412.7856 425.2542 448.7598 476.3450 528.8585 551.8757 584.5952 616.5235 632.6243 663.2458 668.8309 704.2518 746.5348 755.4541 795.7393 819.5612 856.7825 909.5339 912.8578 915.6310 932.0389 946.6374 975.0620 980.2129 989.0384 992.2147 999.2875 1000.5068 1024.8835 1065.6203 1068.7831 1082.9814 1099.3411 1138.3220 1171.4269 1183.0990 1185.8895 1188.8714 1209.3888 1218.2332 1283.6490 1301.9417 1315.7186 1330.2894 1345.9385 1351.9099 1388.0185 1388.5290 1399.1801 1441.0329 1443.8564 1452.5447 1469.3802 1473.2824 1476.9806 1487.2721 1595.1024 1614.7539 1646.1642 2960.7396 2978.6607 2998.5108 3003.1543 3013.4649 3070.0700 3077.4125 3079.9072 3092.9248 3118.6707 3125.8357 3138.4190 3149.0291 3164.5983 3431.6416 3517.9709 3553.2780
redmass: 4.7201 3.9996 3.9427 4.7791 3.6233 3.8036 5.2351 2.2867 1.4090 1.2268 3.3124 3.6886 2.5907 5.2386 4.5169 3.0972 6.0486 3.4799 2.5927 2.8392 2.2989 3.9198 4.8107 2.9729 1.6589 5.6501 3.6710 6.3425 5.9540 1.4513 8.2025 2.0800 1.5390 3.7130 4.5481 3.6995 1.2477 2.5286 1.5355 2.0198 1.4055 2.8391 6.2720 1.4321 2.8775 2.3014 1.8243 1.4753 2.1961 3.6524 1.3433 3.1320 3.2882 1.9361 1.0622 1.1148 1.1101 2.2933 1.6399 1.5144 1.7132 1.3694 1.5520 1.6165 1.3632 1.3225 4.5365 1.2371 1.2829 2.1086 1.0797 1.0626 1.0949 1.0653 1.4421 1.4995 6.0950 6.0896 1.0930 1.0608 1.0364 1.0574 1.0581 1.1006 1.1025 1.1051 1.1079 1.0983 1.0868 1.0863 1.0912 1.0959 1.1015 1.0450 1.0756 1.0966
irintensity: 0.9225 1.4161 1.7104 0.7119 0.6336 0.6879 4.5139 1.6071 0.4265 26.8299 7.4157 17.4040 4.4979 5.1767 5.0779 6.9808 80.8747 7.0616 0.1678 0.6940 11.2751 0.4662 4.5417 20.7407 61.3402 14.7425 6.0617 0.0801 62.0595 219.7990 99.6866 28.4639 91.7571 0.3665 94.7227 62.2244 0.2514 8.3520 9.2251 2.4641 4.5727 1.2205 213.9476 9.3400 1.5853 14.0722 21.1972 2.2437 15.5957 91.8547 0.9529 71.2012 110.5212 8.9305 0.2394 2.3431 0.4319 11.3240 4.0939 21.2082 9.9268 2.9170 1.8749 0.4022 1.2011 1.0213 0.1314 20.5104 52.9465 13.2243 5.9655 1.2410 6.5997 13.2341 29.2256 2.8807 0.2854 4.8208 51.8125 37.8787 27.2364 27.2725 39.4117 13.5836 6.3102 32.7845 38.1754 21.1094 6.1626 0.3722 14.1740 41.1817 21.2064 1.3446 26.4301 1.2328
temp: 298.150 k
press: 1.00000 atm
elementType: 15 8 8 8 7 7 6 6 6 6 6 6 6 6 6 6 6 1 1 1 1 1 1 1 1 1 1 1 1 1 1 1 1 1
symmnumber: 1
zpe: 717076.2 jmol-1
zpe.correction: 0.273120 hartree
zpe.thermalcorrener: 0.290768 hartree
zpe.thermalcorrenthalpy: 0.291712 hartree
zpe.thermalcorrgfe: 0.226321 hartree
zpe.sumelectzpe: -1104.439760 hartree
zpe.sumelectthermal: -1104.422112 hartree
zpe.sumelectthermalent: -1104.421168 hartree
zpe.sumelectthermalfe: -1104.486560 hartree
dipole: -1.4832 5.9169 0.3176
dipole: 6.1082
quadrupole: -95.8674 -115.0136 -110.0455
quadrupole: 21.2917 -1.0575 -0.1245
quadrupole: 11.1081 -8.0381 -3.0700 21.2917 -1.0575 -0.1245
hfenergy: -1104.7128803 hartree
pointgroup: C01 [X(C11H17N2O3P1)]
dipole: 0.5840817 -2.327395 0.1312599 debye
polarizability: 198.2700672|-2.3927414|171.9997499|-0.5826281|-8.447595|106.6944259 unknown
InChI: InChI=1S/C11H17N2O3P/c1-11(12)8-15-17(14,16-9-11)13-7-10-5-3-2-4-6-10/h2-6,13H,7-9,12H2,1H3
charge 0 multiplicity 1
34 atoms
P  -1.567056 1.60841 0.204991
O  -1.917015 0.73005 -1.26202
O  -2.45474 0.764287 1.445078
O  -1.956457 3.133392 0.071166
N  -2.931956 -2.682526 -0.018209
N  0.059031 1.124877 0.577164
C  -3.015484 -1.201769 -0.055961
C  -1.993705 -0.748989 -1.137764
C  -2.505294 -0.719317 1.331856
C  -4.431781 -0.652085 -0.356467
C  1.181327 1.427305 -0.342699
C  2.361329 0.487347 -0.115357
C  3.684804 0.983088 -0.219983
C  2.164706 -0.887859 0.168548
C  4.792613 0.120408 -0.056628
C  3.270126 -1.75048 0.338149
C  4.588523 -1.250217 0.223378
H  -0.997336 -1.165524 -0.895289
H  -2.301663 -1.080613 -2.144907
H  -3.196079 -1.017231 2.140071
H  -1.503129 -1.151415 1.516524
H  -4.450988 0.451172 -0.369444
H  -4.781367 -1.011346 -1.342528
H  -5.147345 -0.998264 0.412822
H  -3.135315 -3.123831 -0.923074
H  -3.500566 -3.102309 0.72709
H  0.296896 1.099307 1.574056
H  1.520134 2.479234 -0.246433
H  0.793375 1.310082 -1.374321
H  3.849781 2.047755 -0.427735
H  1.142845 -1.272077 0.26344
H  5.810228 0.51809 -0.140352
H  3.104713 -2.811335 0.558173
H  5.445843 -1.919621 0.355268
