program: Gaussian 09
title: 000268429
version: EM64L-G09RevD.01
frameworkgroup: C1[X(C10H12N4O3)]
method: RPBEPBE
basis: SDD
operation: Freq
keyword: #p
keyword: freq=noraman
keyword: PBEPBE/SDD
title: #p freq=noraman PBEPBE/SDD
converged: YES YES NO NO
title: Mulliken charges:
elementType: O O O N N N N C C C C C C C C C C H H H H H H H H H H H H
charge: -0.252133 -0.472618 -0.443253 -0.173603 -0.061495 -0.025694 -0.009487 -0.083290 -0.121460 -0.499646 -0.039274 -0.408837 0.157007 -0.224966 0.027089 -0.321109 -0.355208 0.278850 0.257915 0.274126 0.247547 0.233267 0.228590 0.234132 0.355695 0.336589 0.348695 0.262930 0.249640
chargesum: 0.00000
title: Mulliken charges with hydrogens summed into heavy atoms:
elementType: O O O N N N N C C C C C C C C C C
charge: -0.252133 -0.116924 -0.094558 -0.173603 -0.061495 -0.025694 -0.009487 0.195560 0.136455 0.022027 0.193994 0.053885 0.157007 0.111623 0.027089 -0.058179 -0.105569
polarizability: 1.92329793e+02 -1.31639522e+01 1.30097043e+02 -6.09670705e+00 -1.31532587e+01 9.46204078e+01
1716.lowfreq: -20.6835 -3.5177 -0.0006 -0.0004 0.0005 8.0511 10.7273 38.8757 77.1336
frequency: -19.5483 38.7808 77.1316 103.5728 110.4710 143.7434 173.9084 222.0520 234.9466 252.7130 263.2673 306.5233 349.3549 363.8504 390.5584 410.6082 468.6997 484.4181 498.3729 570.3470 591.4319 623.2936 651.7849 668.3905 688.0408 754.2388 780.7908 797.9561 818.8216 858.9299 873.7481 887.5447 902.3604 915.9989 943.7147 946.5697 952.0997 973.7647 1004.4537 1042.2060 1048.0096 1065.9431 1085.9975 1105.4221 1131.1614 1151.2396 1171.5667 1184.7848 1215.1476 1246.4271 1259.9877 1272.8736 1275.7916 1282.5862 1303.1849 1308.6547 1317.0437 1330.2935 1334.3139 1363.7499 1372.7312 1378.5135 1406.8972 1413.1027 1449.5648 1457.0922 1470.5267 1530.0007 1563.3317 2973.3028 3008.2679 3024.5745 3047.8057 3082.3617 3091.0866 3115.5298 3154.0124 3174.6397 3200.3869 3575.1672 3577.5622
redmass: 6.2833 6.0823 6.4405 4.5069 4.3353 6.5246 4.7505 4.4453 4.4157 3.8606 1.1797 2.7933 1.2880 4.6226 2.3678 4.3460 5.3793 5.2636 4.0090 7.8080 5.0431 4.5752 5.7917 6.1790 5.3893 6.9639 5.9807 5.4888 2.6846 4.7277 2.9851 3.8494 1.4815 1.3522 3.0873 1.5138 3.2916 4.8225 2.9209 2.2123 2.1931 3.6823 3.4374 1.8759 1.9555 2.2392 1.6432 1.3285 1.7299 1.3634 2.2327 1.4751 2.9168 3.3087 1.3726 1.4079 1.3061 2.7290 1.3803 1.3093 2.1621 1.4043 1.5075 1.7036 3.2935 1.1011 1.0803 9.2982 7.6939 1.0853 1.0619 1.0841 1.0656 1.0883 1.1045 1.1035 1.0933 1.0929 1.1025 1.0663 1.0668
irintensity: 1.3711 0.1353 0.4586 10.3073 2.2624 0.2945 6.3168 20.7186 6.7904 10.5842 163.7501 5.2740 112.9006 15.0370 40.0207 1.2197 12.4895 12.9858 4.8677 6.5950 12.5090 10.6172 22.5831 6.7711 15.2859 20.0592 8.6914 8.7264 1.5747 47.0322 44.5415 23.3057 13.8064 29.0928 29.2844 1.5734 25.9508 206.2261 28.0210 59.7376 46.0587 15.4875 6.8940 4.3887 8.6822 1.9510 61.5881 39.4602 136.1450 6.3479 3.9296 28.2921 46.4133 88.9772 3.3225 3.4345 2.8137 20.1413 21.0545 0.3360 64.6683 2.2750 7.7718 8.8434 74.8788 22.0701 8.4241 24.8890 69.6151 32.8941 33.8570 19.6912 14.5205 5.8517 24.9072 8.2537 12.0505 12.5277 56.7934 10.8430 11.6278
temp: 298.150 k
press: 1.00000 atm
elementType: 8 8 8 7 7 7 7 6 6 6 6 6 6 6 6 6 6 1 1 1 1 1 1 1 1 1 1 1 1
symmnumber: 1
zpe: 584137.1 jmol-1
zpe.correction: 0.222486 hartree
zpe.thermalcorrener: 0.236198 hartree
zpe.thermalcorrenthalpy: 0.237142 hartree
zpe.thermalcorrgfe: 0.181733 hartree
zpe.sumelectzpe: -831.645188 hartree
zpe.sumelectthermal: -831.631477 hartree
zpe.sumelectthermalent: -831.630533 hartree
zpe.sumelectthermalfe: -831.685941 hartree
dipole: -5.8096 0.0071 0.3250
dipole: 5.8187
quadrupole: -108.2277 -105.3589 -91.2065
quadrupole: -2.7872 7.6776 -1.5365
quadrupole: -6.6300 -3.7612 10.3912 -2.7872 7.6776 -1.5365
hfenergy: -831.8676745 hartree
pointgroup: C01 [X(C10H12N4O3)]
dipole: -2.2763866 -0.0710369 -0.2317581 debye
polarizability: 190.6006077|15.3562743|131.9754|11.405645|-10.7987674|94.4712361 unknown
InChI: InChI=1S/C10H12N4O3/c15-3-8-7(16)1-9(17-8)14-5-13-6-2-11-4-12-10(6)14/h2,4-5,7-9,15-16H,1,3H2
charge 0 multiplicity 1
29 atoms
O  -1.521832 1.213151 0.146128
O  -2.535381 -1.989995 -0.681158
O  -5.125369 0.382175 0.718921
N  0.443705 -0.125912 -0.409481
N  1.622038 -1.868645 0.538289
N  2.227473 1.596432 -0.408729
N  4.339372 0.76287 0.534523
C  -0.662424 0.69564 -0.932815
C  -2.7779 -0.565971 -0.979263
C  -1.624575 -0.058773 -1.876006
C  -2.704209 0.324753 0.297717
C  -3.936294 1.222006 0.486198
C  1.729944 0.363248 -0.151119
C  0.443339 -1.468779 0.031763
C  2.452615 -0.729852 0.433781
C  3.798138 -0.472134 0.770936
C  3.539148 1.721891 -0.037818
H  -0.183181 1.579442 -1.383487
H  -3.761892 -0.459352 -1.471854
H  -1.147559 -0.892763 -2.413757
H  -2.014016 0.657573 -2.61772
H  -2.554547 -0.320409 1.188799
H  -4.148183 1.787959 -0.435944
H  -3.766064 1.941491 1.309834
H  -3.334055 -2.363578 -0.231147
H  -0.449483 -2.087172 -0.063288
H  -5.167825 0.130404 1.675127
H  4.448577 -1.228138 1.22226
H  4.00454 2.695039 -0.21639
