program: Gaussian 09
title: 000268423
version: EM64L-G09RevD.01
frameworkgroup: C1[X(C13H14N2O5)]
method: RPBEPBE
basis: SDD
operation: Freq
keyword: #p
keyword: freq=noraman
keyword: PBEPBE/SDD
title: #p freq=noraman PBEPBE/SDD
converged: YES YES NO NO
title: Mulliken charges:
elementType: O O O O O N N C C C C C C C C C C C C C H H H H H H H H H H H H H H
charge: -0.238232 -0.419133 -0.469399 -0.426219 -0.261484 -0.181022 -0.026301 -0.156609 -0.167946 -0.155677 -0.062817 -0.389537 0.225293 -0.292845 0.121681 0.049175 -0.322292 -0.336098 -0.239994 -0.203681 0.277566 0.283799 0.306834 0.247365 0.228485 0.215741 0.351452 0.360441 0.329799 0.346812 0.272125 0.261962 0.235595 0.235160
chargesum: 0.00000
title: Mulliken charges with hydrogens summed into heavy atoms:
elementType: O O O O O N N C C C C C C C C C C C C C
charge: -0.238232 -0.067680 -0.108958 -0.079406 -0.261484 -0.181022 -0.026301 0.120957 0.115853 0.151157 0.184548 0.054689 0.225293 0.036955 0.121681 0.049175 -0.050167 -0.074136 -0.004399 0.031479
polarizability: 2.49637937e+02 -8.99125009e+00 1.64705773e+02 -1.12529982e+01 -1.14603947e+01 1.04005199e+02
1716.lowfreq: -5.4911 0.0006 0.0006 0.0007 5.1845 11.8729 24.0280 41.2237 55.9900
frequency: 23.5953 41.1496 55.9735 91.0870 96.2687 115.6824 131.7722 149.4515 190.6202 207.0288 233.2740 247.7954 271.8440 303.1752 309.5691 342.0903 364.1857 372.0277 386.9423 416.1756 425.9525 443.5868 485.2197 493.0522 521.1196 530.3944 558.1813 601.4317 610.3176 639.8895 689.6049 713.7467 754.8168 777.5365 785.7371 795.8551 835.5205 854.1680 886.2067 898.5817 917.3970 948.4782 961.1391 968.9646 970.0174 981.9062 991.6822 1004.6493 1005.8517 1021.5187 1038.4755 1045.7634 1089.9430 1104.2079 1122.4489 1134.6984 1148.7184 1175.5253 1199.3089 1212.2472 1217.4874 1224.4947 1243.9612 1257.9265 1279.0111 1281.8350 1301.7459 1317.0416 1342.8058 1356.1064 1367.1948 1386.7993 1394.0727 1408.9049 1432.6137 1452.8360 1459.2673 1474.8496 1552.6033 1565.2116 1612.7418 1620.8582 2983.1049 2995.6723 3032.4235 3078.2821 3087.1480 3089.2368 3109.2395 3136.4478 3151.1094 3166.1460 3175.6028 3536.4755 3563.0708 3583.9491
redmass: 5.7660 6.2350 6.4771 3.8052 5.1963 5.5586 5.4538 4.9357 6.3681 5.2878 4.7636 4.8139 3.7935 2.5479 1.9776 1.2811 1.1613 3.2170 4.9047 3.9840 3.1804 4.0357 5.7100 5.9693 6.0998 5.5444 9.4187 3.8935 6.8870 5.6802 4.4813 6.1064 6.5336 6.2259 1.5414 3.5206 4.7607 2.5530 4.8922 1.5081 3.7231 4.1800 3.6883 2.8372 1.6845 1.3828 3.9811 1.3399 5.4436 2.3506 2.7591 1.9776 2.6749 1.7380 1.9325 1.2513 2.0958 1.3582 1.6872 1.6929 1.3615 2.1640 2.2201 1.2821 1.5466 1.6242 1.3973 1.3149 1.2793 1.2100 1.2629 5.1556 1.5192 1.3903 1.6059 2.1526 2.6460 1.0862 5.6928 7.0303 8.3405 8.0258 1.0846 1.0646 1.0866 1.0865 1.0992 1.0896 1.0981 1.0863 1.0902 1.0956 1.0997 1.0661 1.0663 1.0666
irintensity: 0.2369 0.1609 2.7590 0.2865 4.7897 3.5421 4.5637 1.1314 2.3259 8.0050 2.4987 10.1093 43.7613 74.3275 105.6447 88.5310 156.4111 16.9327 53.1319 12.4745 13.2112 4.0555 3.0759 10.4955 1.9534 10.5730 4.5722 2.0024 5.0674 11.9289 19.2511 9.5070 22.9640 60.2427 74.7423 8.4228 6.1490 15.3044 39.1748 0.7076 13.6655 30.7409 35.6117 177.1466 29.3690 4.7132 85.2416 0.4903 128.3998 46.9510 28.9220 9.2171 22.9672 8.1951 68.9317 30.2753 11.7083 10.4114 54.6471 19.1205 16.9205 16.8589 58.9038 16.1036 40.2604 13.3591 6.5201 5.7680 21.6583 15.1620 13.4988 19.8292 0.7094 33.1941 31.2540 0.1364 58.7780 6.2454 116.7405 35.2580 248.7901 111.0977 20.4945 40.1376 16.6561 19.9614 24.2270 13.6147 65.1724 4.5720 7.5773 10.8166 20.5169 12.9307 12.5226 15.9442
temp: 298.150 k
press: 1.00000 atm
elementType: 8 8 8 8 8 7 7 6 6 6 6 6 6 6 6 6 6 6 6 6 1 1 1 1 1 1 1 1 1 1 1 1 1 1
symmnumber: 1
zpe: 681463.8 jmol-1
zpe.correction: 0.259556 hartree
zpe.thermalcorrener: 0.277251 hartree
zpe.thermalcorrenthalpy: 0.278196 hartree
zpe.thermalcorrgfe: 0.213333 hartree
zpe.sumelectzpe: -987.912118 hartree
zpe.sumelectthermal: -987.894422 hartree
zpe.sumelectthermalent: -987.893478 hartree
zpe.sumelectthermalfe: -987.958341 hartree
dipole: -0.3812 -2.3502 0.3524
dipole: 2.4069
quadrupole: -103.0466 -122.0283 -115.6203
quadrupole: 0.8410 -2.4037 -1.3417
quadrupole: 10.5185 -8.4632 -2.0553 0.8410 -2.4037 -1.3417
hfenergy: -988.1716737 hartree
pointgroup: C01 [X(C13H14N2O5)]
dipole: -0.1789186 -0.6297612 0.684151 debye
polarizability: 249.1757897|-15.5434126|130.1658387|-1.0103904|-32.4177273|139.00728 unknown
InChI: InChI=1S/C13H14N2O5/c16-5-9-10(17)11(18)13(20-9)15-6-14-8-4-2-1-3-7(8)12(15)19/h1-4,6,9-11,13,16-18H,5H2
charge 0 multiplicity 1
34 atoms
O  -1.980173 0.095499 -1.352293
O  -2.989378 2.677301 0.088704
O  -2.851267 -0.522451 1.948669
O  -5.24967 -1.522478 -0.491656
O  1.164421 1.727245 -1.754002
N  0.06769 0.515942 -0.050755
N  1.258106 -0.945654 1.465681
C  -2.238006 1.507273 0.552344
C  -3.1856 0.277827 0.759908
C  -1.223287 1.06184 -0.532541
C  -2.941788 -0.628043 -0.472172
C  -4.19572 -0.916706 -1.3136
C  1.244178 0.907006 -0.793504
C  0.149015 -0.37973 1.029289
C  2.488513 0.275636 -0.319639
C  2.45663 -0.630899 0.789557
C  3.717627 0.566974 -0.967705
C  3.666509 -1.232755 1.230603
C  4.905093 -0.035801 -0.521439
C  4.876355 -0.937545 0.580336
H  -1.760423 1.834713 1.488787
H  -4.232404 0.629638 0.815474
H  -0.946846 1.886477 -1.20922
H  -2.483824 -1.575154 -0.11948
H  -3.929725 -1.552947 -2.180823
H  -4.630603 0.023684 -1.690527
H  -3.341246 2.497243 -0.822117
H  -3.210237 -0.08643 2.761024
H  -0.794134 -0.605745 1.54098
H  -4.936775 -2.396069 -0.144286
H  3.706359 1.263757 -1.812084
H  3.618457 -1.921024 2.079611
H  5.854484 0.186333 -1.019743
H  5.806165 -1.404254 0.92362
