program: Gaussian 09
title: 000268403
version: EM64L-G09RevD.01
frameworkgroup: C1[X(C20H24N4O2)]
method: RPBEPBE
basis: SDD
operation: Freq
keyword: #p
keyword: freq=noraman
keyword: PBEPBE/SDD
title: #p freq=noraman PBEPBE/SDD
converged: YES YES NO NO
title: Mulliken charges:
elementType: O O N N N N C C C C C C C C C C C C C C C C C C C C H H H H H H H H H H H H H H H H H H H H H H H H
charge: -0.265576 -0.265576 -0.107094 -0.107094 -0.025207 -0.025208 -0.367272 -0.361190 -0.361190 -0.367272 -0.377628 -0.377626 0.441658 0.441655 -0.376737 -0.376737 -0.386886 -0.386885 -0.356803 -0.356803 -0.343159 -0.343160 0.320821 0.320821 -0.537811 -0.537811 0.214260 0.238973 0.213295 0.227303 0.227303 0.213296 0.238972 0.214261 0.197166 0.197167 0.220046 0.220047 0.261804 0.261804 0.247889 0.247889 0.236897 0.236897 0.220778 0.220828 0.243643 0.220828 0.220777 0.243643
chargesum: 0.00000
title: Mulliken charges with hydrogens summed into heavy atoms:
elementType: O O N N N N C C C C C C C C C C C C C C C C C C C C
charge: -0.265576 -0.265576 -0.107094 -0.107094 -0.025207 -0.025208 0.085961 0.079409 0.079409 0.085961 -0.180462 -0.180459 0.441658 0.441655 -0.156690 -0.156690 -0.125082 -0.125080 -0.108913 -0.108913 -0.106263 -0.106263 0.320821 0.320821 0.147438 0.147438
polarizability: 6.09714226e+02 -2.93688407e-01 2.35003380e+02 -2.43704361e+00 2.06533219e+00 1.25992795e+02
1716.lowfreq: -3.5890 -0.0014 0.0012 0.0018 2.9173 9.5227 10.0301 24.0431 30.1235
frequency: 9.5227 24.0431 30.1235 37.5510 51.1870 61.4728 63.2572 85.2810 104.4886 117.3157 130.7636 143.6265 182.5551 198.9992 206.0702 217.4816 228.8428 245.7541 248.1189 256.9329 279.4315 285.7023 309.8837 312.5480 340.5283 390.9001 392.1281 415.8357 416.5468 419.8053 450.4592 454.8450 481.6478 495.1717 526.6762 527.5881 530.3612 539.7119 588.1583 631.7306 632.9447 639.9489 729.7636 732.5477 732.9944 743.6424 772.1824 786.1893 818.8607 818.8694 829.0391 829.2055 832.3228 868.0213 875.1245 891.6121 892.0806 954.8336 954.8461 969.1061 969.3082 969.4097 981.8918 987.3027 988.2930 999.2205 1000.2048 1016.6373 1049.4916 1062.8820 1103.9926 1109.6921 1111.6120 1111.6422 1120.1238 1134.4254 1155.0922 1155.8257 1155.9577 1172.5238 1172.6854 1190.7476 1223.4681 1224.3456 1228.9380 1238.1988 1245.0658 1274.2719 1284.1287 1297.3731 1304.3224 1305.9025 1340.1465 1342.1451 1358.1089 1359.3073 1361.7325 1368.9017 1392.8358 1392.8519 1422.5606 1422.6750 1436.4726 1436.4738 1456.1094 1458.5998 1464.4093 1466.0735 1466.0745 1470.0454 1472.8874 1473.0180 1502.1122 1502.3139 1560.1186 1561.2939 1585.0623 1585.5845 1620.7599 1620.8625 2916.7615 2919.4004 2929.4880 2933.5483 2958.4064 2958.4697 3017.1173 3017.1639 3045.6678 3045.6749 3052.4450 3052.5993 3083.5677 3084.2292 3119.3230 3119.3323 3123.1118 3123.1264 3144.6486 3144.6636 3164.2141 3164.2221 3167.5084 3167.5434
redmass: 5.5668 4.1705 4.3979 5.0615 3.1486 5.0725 4.1942 3.7007 3.8474 4.5120 5.9982 4.6319 2.9450 2.3361 2.0855 3.2408 1.7408 1.4521 1.8400 3.7990 3.3341 3.7153 3.5571 3.1986 2.2467 5.1477 5.0246 3.2517 3.0500 5.1960 4.2850 3.3628 5.1210 4.4314 2.9542 2.3911 3.2114 4.5144 6.2048 6.6394 6.9577 2.3491 4.7466 3.6259 3.7564 4.0659 5.3183 4.0723 1.2543 1.2543 1.5924 1.5851 1.6419 4.5526 3.6644 1.5403 1.5441 1.3964 1.3981 1.8748 1.3513 1.5584 2.3870 8.6380 7.0923 2.6732 2.5704 2.6269 1.7040 2.2888 1.7506 1.3905 1.2608 1.2620 1.8091 2.3222 3.2619 1.3391 1.3394 1.2032 1.2023 1.1411 2.3831 2.7372 3.9219 2.6289 2.2608 1.4375 1.5218 1.3330 1.3772 1.3344 1.3015 1.6105 2.5868 1.9226 1.9184 1.7931 2.1663 2.2130 3.5428 3.5455 1.2104 1.2112 1.0808 1.0819 1.0875 1.0504 1.0504 1.0936 1.0766 1.0755 2.5820 2.5899 6.7184 6.8324 5.9778 5.9209 6.3810 6.3917 1.0707 1.0702 1.0686 1.0677 1.0329 1.0329 1.0860 1.0861 1.1038 1.1038 1.0913 1.0913 1.0913 1.0912 1.0891 1.0891 1.0993 1.0993 1.0870 1.0870 1.0951 1.0951 1.0958 1.0958
irintensity: 0.0825 1.2736 1.1972 0.0000 0.0000 0.0000 2.7914 0.0000 8.6576 0.0000 0.0000 12.1292 27.9693 0.0000 10.5038 0.0000 21.5925 0.0000 3.5263 6.6662 0.0000 11.5892 0.0000 44.5603 0.0000 0.0000 12.9553 0.0000 0.9515 0.0000 30.9339 0.0000 43.4849 0.0000 0.0001 50.2018 0.0000 22.3144 0.0000 3.1326 0.0000 133.4547 0.0000 3.2894 0.0000 3.0388 0.0000 11.9841 0.2234 0.0004 0.0025 108.2372 0.0000 26.1950 0.0000 0.0016 104.9986 0.0015 4.0597 94.5005 0.0000 58.1639 333.8384 0.0000 52.2561 0.0000 12.4023 0.0000 8.5146 0.0000 222.1750 0.0000 1.0398 0.0002 282.0584 0.0000 58.1526 0.7413 0.0000 162.4818 0.0004 0.0000 275.8154 0.0000 0.0000 357.1522 0.0000 30.4224 9.6124 0.0000 3.6269 0.0000 0.0000 118.1754 0.0000 0.0000 60.3452 220.1439 4.6810 0.0063 4.0952 0.0000 0.1434 22.7342 28.9638 0.0000 85.2074 0.0410 26.2091 0.0000 132.6599 0.0002 214.2284 0.0005 157.4442 0.0000 21.7171 0.0000 178.2849 0.0008 55.1747 0.0000 0.0000 238.1121 176.1525 0.0001 0.8792 119.9390 0.0985 100.8675 60.2632 0.0012 32.2025 0.0007 0.1218 38.4576 62.8593 0.0163 17.8768 0.5755 4.0123 27.6871 18.4430 0.1094
temp: 298.150 k
press: 1.00000 atm
elementType: 8 8 7 7 7 7 6 6 6 6 6 6 6 6 6 6 6 6 6 6 6 6 6 6 6 6 1 1 1 1 1 1 1 1 1 1 1 1 1 1 1 1 1 1 1 1 1 1 1 1
symmnumber: 1
zpe: 1067271.9 jmol-1
zpe.correction: 0.406502 hartree
zpe.thermalcorrener: 0.431254 hartree
zpe.thermalcorrenthalpy: 0.432198 hartree
zpe.thermalcorrgfe: 0.349149 hartree
zpe.sumelectzpe: -1143.965587 hartree
zpe.sumelectthermal: -1143.940835 hartree
zpe.sumelectthermalent: -1143.939891 hartree
zpe.sumelectthermalfe: -1144.022940 hartree
dipole: 0.0000 0.0000 0.0002
dipole: 0.0002
quadrupole: -140.1707 -133.6028 -161.3871
quadrupole: -27.2157 0.0130 0.0131
quadrupole: 4.8828 11.4507 -16.3336 -27.2157 0.0130 0.0131
hfenergy: -1144.3720891 hartree
pointgroup: C01 [X(C20H24N4O2)]
dipole: 0.0000039 -0.0000192 0.000076 debye
polarizability: 609.6368002|-5.2494119|229.6820898|3.2112607|23.6900422|131.3915123 unknown
InChI: InChI=1S/C20H24N4O2/c1-25-19-7-3-17(4-8-19)15-21-23-11-13-24(14-12-23)22-16-18-5-9-20(26-2)10-6-18/h3-10,15-16H,11-14H2,1-2H3
charge 0 multiplicity 1
50 atoms
O  9.315853 -0.030986 0.125679
O  -9.315504 0.02826 -0.144926
N  1.420701 -0.061732 -0.109521
N  -1.420356 0.058945 0.090314
N  2.788652 -0.282213 -0.053176
N  -2.788307 0.279429 0.033961
C  0.645998 -1.291899 0.146445
C  0.782823 1.177769 0.393272
C  -0.782477 -1.180557 -0.412477
C  -0.645651 1.289111 -0.165651
C  3.643119 0.697639 0.188942
C  -3.642776 -0.700418 -0.208169
C  5.091743 0.453567 0.155906
C  -5.0914 -0.456339 -0.175127
C  5.989712 1.522323 0.445401
C  -5.989376 -1.52506 -0.464723
C  5.646143 -0.818429 -0.155519
C  -5.64579 0.815635 0.136407
C  7.38158 1.332075 0.428191
C  -7.381242 -1.334798 -0.447515
C  7.039446 -1.02407 -0.176443
C  -7.039091 1.021291 0.157329
C  7.913823 0.055967 0.117221
C  -7.913475 -0.05871 -0.136445
C  9.914944 -1.329816 -0.187211
C  -9.914587 1.327062 0.168095
H  0.59082 -1.495377 1.239741
H  1.184827 -2.125856 -0.331591
H  1.355146 2.055069 0.043558
H  0.770453 1.189675 1.507289
H  -0.770106 -1.192466 -1.526494
H  -1.3548 -2.057856 -0.062761
H  -1.184479 2.123069 0.312386
H  -0.590473 1.492591 -1.258946
H  3.335615 1.734101 0.41577
H  -3.335275 -1.736878 -0.435006
H  5.587805 2.51463 0.686728
H  -5.587478 -2.517351 -0.706132
H  4.961637 -1.641999 -0.382506
H  -4.961276 1.639175 0.363478
H  8.073929 2.149885 0.64981
H  -8.073598 -2.15258 -0.669212
H  7.432289 -2.015936 -0.420821
H  -7.431923 2.013138 0.401798
H  9.647766 -1.661877 -1.209521
H  9.608474 -2.102407 0.544902
H  11.001107 -1.168515 -0.12238
H  -9.608101 2.099728 -0.563932
H  -9.647418 1.659013 1.190443
H  -11.000751 1.165779 0.103235
