program: Gaussian 09
title: 000268390
version: EM64L-G09RevD.01
frameworkgroup: C1[X(C18H18Cl2N4)]
method: RPBEPBE
basis: SDD
operation: Freq
keyword: #p
keyword: freq=noraman
keyword: PBEPBE/SDD
title: #p freq=noraman PBEPBE/SDD
converged: YES YES NO NO
title: Mulliken charges:
elementType: Cl Cl N N N N C C C C C C C C C C C C C C C C C C H H H H H H H H H H H H H H H H H H
charge: -0.082679 -0.082679 -0.107237 -0.107238 -0.019016 -0.019017 -0.364692 -0.361762 -0.361762 -0.364692 -0.361338 -0.361339 0.507654 0.507655 -0.292988 -0.292989 -0.361823 -0.361824 -0.231949 -0.231949 -0.228922 -0.228922 -0.228851 -0.228851 0.220744 0.243611 0.222758 0.234569 0.234568 0.222758 0.243611 0.220744 0.223494 0.223494 0.271079 0.271079 0.254004 0.254004 0.229499 0.229498 0.233849 0.233849
chargesum: 0.00000
title: Mulliken charges with hydrogens summed into heavy atoms:
elementType: Cl Cl N N N N C C C C C C C C C C C C C C C C C C
charge: -0.082679 -0.082679 -0.107237 -0.107238 -0.019016 -0.019017 0.099663 0.095564 0.095565 0.099662 -0.137844 -0.137845 0.507654 0.507655 -0.292988 -0.292989 -0.090745 -0.090745 0.022055 0.022055 0.000576 0.000576 0.004998 0.004998
polarizability: 5.15439850e+02 -2.24144292e+01 2.57556421e+02 -4.79076413e+00 1.46968453e+00 1.07755760e+02
1716.lowfreq: -8.5492 -5.9868 -0.0014 -0.0012 -0.0004 1.5904 13.4798 17.5986 29.5003
frequency: 13.4798 17.5986 29.5003 38.5724 49.4985 63.7317 92.2711 115.4434 128.9487 143.4099 164.1560 168.8707 195.7956 221.9675 228.3157 236.0360 284.8506 284.8524 294.1327 331.4766 336.8412 366.6004 373.6336 389.3205 389.3879 451.3608 451.4445 459.0676 498.8551 505.5026 535.2858 537.4275 542.3147 584.9342 623.0056 641.6187 679.8186 683.7841 724.7367 724.9343 759.6151 760.8849 761.0041 786.3319 828.8012 864.5899 869.6693 871.7039 874.1768 894.9597 895.3893 953.5390 953.5576 969.4832 985.0329 993.2089 993.2337 1006.0070 1010.7643 1025.5653 1035.8127 1036.6433 1047.3119 1062.6475 1111.5721 1116.8245 1131.3853 1144.0874 1156.1929 1167.9535 1168.0164 1193.6940 1222.6353 1227.0520 1228.2197 1266.4565 1281.0665 1286.0914 1288.9507 1303.8619 1342.6827 1342.9178 1355.6507 1359.8396 1361.4598 1369.7419 1391.7598 1391.8602 1425.8350 1426.0043 1455.8356 1458.3646 1460.3872 1462.7029 1464.9532 1468.4863 1550.8334 1552.5300 1572.0903 1573.1528 1603.0784 1603.2814 2929.3548 2931.6530 2940.9611 2944.6761 3059.5674 3060.0049 3075.1289 3075.3721 3088.0151 3088.6065 3135.3479 3135.3564 3151.7177 3151.7208 3164.6841 3164.6870 3175.4762 3175.5109
redmass: 6.1090 9.2083 6.9122 3.2349 5.4551 8.1042 4.3760 4.3932 6.7427 5.9950 4.6777 4.7329 2.6506 7.0702 4.9971 2.8487 2.8279 2.8603 3.4034 4.4493 3.3467 4.0658 8.1049 6.4990 8.8724 3.4108 3.3784 3.1577 8.1145 5.6303 3.4819 3.6972 4.4626 3.9225 6.1863 3.3158 6.5481 4.0735 3.7117 3.7003 3.5924 1.2499 1.4040 3.7412 1.6481 3.3999 1.5741 1.4764 2.5581 1.5706 1.5747 1.3689 1.3690 2.2856 2.3203 1.3389 1.3394 5.6503 6.6325 2.8607 1.9749 1.9369 1.7014 2.3630 2.0538 1.7469 1.9524 2.2601 3.3594 1.0623 1.0616 1.1330 1.6650 1.5993 4.5337 1.5630 1.7175 1.5158 1.5797 1.3069 1.6892 1.2820 3.3070 1.6209 1.9941 1.6130 2.3491 2.2833 2.4802 2.4682 1.0839 1.1243 1.6569 2.5965 1.4996 1.0935 5.7390 5.8868 5.6692 5.6559 7.0769 7.0542 1.0708 1.0706 1.0678 1.0673 1.0924 1.0926 1.0865 1.0867 1.0920 1.0919 1.0858 1.0858 1.0902 1.0902 1.0949 1.0949 1.1000 1.1000
irintensity: 0.1510 0.7729 0.5161 0.0000 0.0000 0.0000 3.9600 0.0000 0.0000 10.9769 3.6863 0.0000 28.3106 0.0000 10.0608 17.4019 14.1534 2.9393 0.0000 30.1363 0.0000 0.0000 13.4439 9.3206 0.0000 0.0000 22.0119 0.0000 0.0000 29.4965 4.6519 0.0000 0.0000 2.9039 0.0000 67.5053 0.0000 110.0539 0.0000 11.5093 0.0000 154.8089 0.0070 6.2059 0.0000 4.7057 0.0000 3.9635 0.0000 0.0005 69.7716 0.0055 8.6362 95.4732 207.4673 0.0002 1.9174 0.0000 105.3910 0.0000 12.9210 0.0000 3.5012 0.0000 143.9417 0.0000 301.8035 0.0000 69.5588 0.0001 2.7087 0.0000 37.2917 0.0000 0.0000 39.2449 0.0000 41.4864 13.1226 0.0000 64.5523 0.0001 0.0000 0.0000 94.8831 203.3915 0.0001 18.5235 0.0000 52.6373 38.3427 0.0000 25.5533 0.0000 87.6148 0.0000 247.0345 0.0000 180.3404 0.0000 12.3110 0.0000 47.9374 0.0000 0.0000 195.3492 49.3992 0.0002 0.0113 71.7552 27.1636 0.0000 6.0524 0.0601 14.1564 2.3346 3.9263 14.3081 43.7527 0.0431
temp: 298.150 k
press: 1.00000 atm
elementType: 17 17 7 7 7 7 6 6 6 6 6 6 6 6 6 6 6 6 6 6 6 6 6 6 1 1 1 1 1 1 1 1 1 1 1 1 1 1 1 1 1 1
symmnumber: 1
zpe: 852806.2 jmol-1
zpe.correction: 0.324817 hartree
zpe.thermalcorrener: 0.346748 hartree
zpe.thermalcorrenthalpy: 0.347692 hartree
zpe.thermalcorrgfe: 0.270121 hartree
zpe.sumelectzpe: -1834.042816 hartree
zpe.sumelectthermal: -1834.020885 hartree
zpe.sumelectthermalent: -1834.019940 hartree
zpe.sumelectthermalfe: -1834.097512 hartree
dipole: 0.0000 0.0000 0.0000
dipole: 0.0000
quadrupole: -151.1724 -146.7454 -161.2204
quadrupole: -15.2424 0.1446 -0.8298
quadrupole: 1.8737 6.3006 -8.1743 -15.2424 0.1446 -0.8298
hfenergy: -1834.3676323 hartree
pointgroup: C01 [X(C18H18Cl2N4)]
dipole: 0.000003 0.0000022 0.0000032 debye
polarizability: 517.3349659|5.0346228|235.8776687|-2.5503392|50.3792945|127.5393968 unknown
InChI: InChI=1S/C18H18Cl2N4/c19-17-7-3-1-5-15(17)13-21-23-9-11-24(12-10-23)22-14-16-6-2-4-8-18(16)20/h1-8,13-14H,9-12H2
charge 0 multiplicity 1
42 atoms
Cl 5.763192 -2.526291 -1.140556
Cl -5.761998 2.530447 1.186529
N  1.409905 0.176118 0.118883
N  -1.40869 -0.171935 -0.072912
N  2.746662 0.505245 0.143931
N  -2.745447 -0.501065 -0.097966
C  0.528911 1.357657 0.038278
C  0.879351 -1.044714 -0.53293
C  -0.878135 1.048897 0.578901
C  -0.527695 -1.353474 0.007695
C  3.68453 -0.365116 -0.196301
C  -3.683321 0.369291 0.242263
C  5.098511 0.012639 -0.072978
C  -5.097299 -0.008474 0.118941
C  6.150742 -0.860968 -0.459747
C  -6.149536 0.865124 0.505714
C  5.490452 1.28577 0.444225
C  -5.489231 -1.281607 -0.398266
C  7.511141 -0.519027 -0.352387
C  -7.509933 0.523174 0.398353
C  6.843221 1.650122 0.559022
C  -6.841998 -1.645967 -0.513063
C  7.86228 0.748994 0.161614
C  -7.861063 -0.744848 -0.115651
H  0.443981 1.701843 -1.016289
H  1.00045 2.161324 0.626095
H  1.53177 -1.902744 -0.295918
H  0.857705 -0.917399 -1.638417
H  -0.856489 0.921581 1.684388
H  -1.530553 1.906928 0.341891
H  -0.999233 -2.157143 -0.58012
H  -0.442763 -1.697658 1.062262
H  3.478927 -1.379107 -0.569542
H  -3.477725 1.383282 0.61551
H  4.69074 1.967552 0.749415
H  -4.689514 -1.963381 -0.703459
H  8.279726 -1.23151 -0.665301
H  -8.278523 1.23565 0.711271
H  7.109442 2.634283 0.959465
H  -7.108212 -2.630129 -0.913508
H  8.918262 1.024614 0.249638
H  -8.917044 -1.020475 -0.203676
